Fri Apr 18 2014 19:11:35 UTC

This list is too long for Bugzilla's little mind; the Next/Prev/First/Last buttons won't appear on individual bugs.

Hide Search Description
  • Keywords: TEST

This result was limited to 500 bugs. See all search results for this query.
ID Product Comp Assignee Status Resolution Summary Changed
61014 apisuppo Project mkozeny NEW --- Rewrite/enhance current tests 2013-02-14
155751 qa Jellytoo issues NEW --- About This Mac dialog opened on HelpOperator.invoke() 2009-03-13
87164 editor Lexer mmetelka NEW --- Provide unit testing framework for lexer 2006-12-15
103568 serverpl JBoss mmocnak NEW --- jboss tests fail to compile 2007-08-03
187719 python Testing tor NEW --- NB can't run tests in packages 2010-06-17
77786 javaee Code abadea NEW --- Move the TestUtil class in j2ee/earproject to a common location 2006-06-14
211788 cnd executio ilia NEW --- IDE hangs in tests on closing due to Authentication dialog 2013-11-11
108274 uml Diagram issues NEW --- Time to open an existing diagram exceeds threshold 2009-05-25
133098 uml Diagram issues NEW --- Time to create class diagram from 30 nodes exceeds threshold 2009-05-25
133118 uml Diagram issues NEW --- Time to generate dependency diagram exceeds threshold 2009-05-25
180503 ruby Project issues NEW --- "testRubyApplicationPanel" in "org.netbeans.jellytools.NewRubyProjectNameLocationStepOperatorTest" class fails on any Windows XP platform (XP Pro or XP Home) with JDK 6u19 b02. 2011-11-16
182724 ide BlueJ issues NEW --- No Unit Tests For o.n.bluej 2010-07-30
191788 ruby Testing issues NEW --- Rails 3 Projects: test summary and test navigation tree not seeing tests 2011-01-28
194634 javaee Code issues NEW --- Failing tests on the javaee build job 2012-10-18
238806 platform Graph issues NEW --- org.netbeans.modules.visual.apichanges.LabelOrientationTest testLabelOrientations fails on Mac OSX 2013-11-29
150124 javame Visual D jstola NEW --- design an API to replace J2MEDataLoader and J2MEDataObject 2012-04-16
240924 db SQL Edit lfischmeistr NEW --- Failing SelectCompletionQueryTest on JDK8 2014-03-03
214083 platform Outline& mentlicher NEW --- TreeTableView152857Test - all tests are fragile 2012-06-14
41356 apisuppo Harness mkozeny NEW --- Move ValidateLayer*Test to ide/test/qa-functional/ or to general build harness 2013-12-27
129002 webservi Customiz mkuchtiak NEW --- Ws impl class is not refreshed after submitting changes in cust. editor 2013-08-27
240860 editor Lexer mmetelka NEW --- Failing TokenSequenceTest on JDK8 and Windows 2014-01-24
240857 php Editor obrejla NEW --- Failing NavigatorDeprecatedTest on JDK8 2014-01-24
237546 javascri Editor phejl NEW --- Failing Tests on JDK8 2014-01-16
149553 javaee Hibernat sj-nb NEW --- org.netbeans.modules.hibernate classes are loaded during NetBeans startup with LimeWire 2011-11-16
147107 xml WSDL Too skini NEW --- Add New WSDL Document 1st run regression since 6.1 2008-10-01
42889 java Platform tzezula NEW --- Migrate tests to use MasterFS 2011-08-31
239366 editor Parsing tzezula NEW --- Failing InjectedTasksSupportTest on JDK8 2014-01-24
173095 cnd Debugger henk89 NEW --- Don't load com.sun.tools.* classes at startup Mon 19:33
143075 javaee Spring issues NEW --- Startup regression: org.netbeans.modules.spring.beans.jumpto.GoToBeanAction 2010-12-01
26697 debugger Code lcincura NEW --- Testing 64bit solaris programs 2005-05-16
137760 projects Ant Proj mkleint NEW --- ReferenceHelperTest.testForeignFileReferences failing 2013-01-14
177535 projects Generic mkleint NEW --- RecentProjectsTest fails consistently 2012-06-14
128556 webservi Client mkuchtiak NEW --- Move Down button sometimes doesn't work in Configure Handlers 2013-07-24
221321 www Builds & pgebauer NEW --- Commit validation should detect orphaned modules on a per-cluster basis 2013-01-08
154754 groovy Grails phejl NEW --- AccessControlException when test run finish 2009-02-19
106271 editor Code fol sdedic NEW --- Fold.toString() resturns different strings on 1.5.0 and 6_01 2011-09-05
137748 editor Key bind sdedic NEW --- KeymapViewModelTest.testChangeShortcutsOk fails 2012-10-24
230748 java Hints sdedic NEW --- Warnings from TokenHierarchyOperation when running Java hints 2013-09-02
156016 editor Parsing tzezula NEW --- org.netbeans.modules.parsing classes are loaded on 1st and 2nd NetBeans startup 2011-08-31
235612 cnd Code Com petrk STAR --- failing MetaprogrammingTestCase 2014-02-10
194549 ide Performa thurka STAR --- BlacklistedClassesHandlerSingleton is noisy 2012-11-07
206540 ide Performa thurka STAR --- Incorrectly displayed error badges on performance/* 2012-06-11
234511 profiler Base issues REOP --- Make OQL engine work with Nashorn 2013-12-12
194639 javaee JSP issues REOP --- JSP parser + editor tests failing 2011-10-31
149557 versionc Code issues REOP --- DiffFileEncodingQueryImpl class is loaded twice during NetBeans startup with LimeWire project 2009-02-19
149564 javaee Spring issues REOP --- org.netbeans.modules.spring classes are loaded during NetBeans startup with LimeWire project 2010-12-01
140133 java Project tzezula REOP --- PackageViewTest.testCopyPaste failing consistently 2012-10-26
238790 platform JDK Prob anebuzelsky RESO WONT Deadlock in tests execution. 2013-12-16
32583 qa Jellytoo asotona RESO FIXE BundleKeysTest failing 2003-07-23
133857 xml XSL ca-nb RESO DUPL Commit validation failure: NPE in XSLTEditorOperator.bindSourceToMethoid 2008-04-28
129819 editor Completi dbalek RESO DUPL tests fail on assert 2009-02-19
138731 javaee Code dkolar RESO FIXE Uncompilable tests 2008-07-01
128557 javaee EAR dkonecny RESO DUPL Add module action does not modify mandatory DD 2008-02-28
126652 java Refactor dprusa RESO DUPL NPE from JavaRefactoringPlugin.processFiles 2008-02-10
240878 cnd Code Com henk89 RESO FIXE Completion and hyperlink tests are failed Thu 13:48
113218 uml General issues RESO DUPL Commit validation failing 2007-08-20
139238 obsolete language issues RESO FIXE Uncompilable tests 2008-07-09
140073 serverpl Sun Apps issues RESO FIXE Uncompilable tests 2008-07-15
181571 cnd Debugger issues RESO DUPL File name is empty in New Breakpoint window 2010-03-05
182660 editor Painting issues RESO FIXE [69cat] [Editor]NullPointerException at org.netbeans.modules.editor.lib2.view.EditorBoxView.getViewIndexFirst 2010-06-24
182677 editor Painting issues RESO DUPL [69cat] IllegalStateException: Unfinished non-first replace pReplace=viewId=PV@00f89d64, index=0, removeCount=0, addedCount=1, Added: [0]: TV@00253cd7:<274,275> 2010-03-31
189681 editor Painting issues RESO FIXE Automatic tests fails with OutOfMemoryError 2010-09-25
146901 ide Code ivansidorkin RESO FIXE org.netbeans.test.ide.MemoryValidationTest 2008-09-16
138721 platform NB JUnit jglick RESO FIXE Commit validation failing on Macs 2009-09-29
194044 projects Ant Proj jglick RESO FIXE Deadlock while closing IDE (in automated tests) 2011-01-31
231316 platform Filesyst jhavlin RESO FIXE AssertionFailedError: Resolver should be queried if array of desired MIME types is empty. 2013-06-18
231245 platform Nodes JPESKA RESO FIXE org.openide.nodes.ChildrenArrayNodeAtShouldNotBeSlowTest failures 2013-06-19
231251 platform Nodes JPESKA RESO WONT org.openide.nodes.ChildrenKeysTest.testGCWhenGetNodesTrue did not finish in 35000ms 2013-06-17
205701 db Code jrechtacek RESO FIXE db.core tests can not be compiled 2011-11-30
46476 ide Code jskrivanek RESO FIXE Commit validation fails on pure sources 2004-07-27
71591 qa Jellytoo jskrivanek RESO FIXE NoSuchPathException when performing action on node 2006-10-23
82729 platform NB JUnit jskrivanek RESO FIXE NBJUnit's TimeOut test is not working 2009-09-29
127239 platform Data Sys jtulach RESO FIXE Layer folder marked as invalid 2008-12-22
153847 platform Window S jtulach RESO DUPL Deadlock during commit validation 2009-02-19
159622 javaee EAR jtulach RESO FIXE Failing tests 2009-03-25
160716 ide Features jtulach RESO FIXE Failed ergonomic-based tests in cnd-main 2009-06-21
178109 platform Lookup jtulach RESO FIXE Stack overflow in XMLDataObjectInfoParser.lookupCookie 2009-12-05
178155 platform NB JUnit jtulach RESO FIXE Exceptions in MockServices 2010-01-11
189171 ide Features jtulach RESO FIXE commit-validation fails in cluster.config=standard due to DynamicVerifyTest 2010-08-04
211724 platform Module S jtulach RESO DUPL ValidateModulesTest.testAutomaticDependenciesUnused fails. 2012-04-25
211725 ide Features jtulach RESO DUPL Broken tests CachingPreventsLoadingOfModuleManifestsTest.BeforeFirstTest and DynamicVerifyTest.testEnable 2012-04-25
215948 platform Lookup jtulach RESO FIXE ValidateLayerConsistencyTest.testNbinstHost randomly fails 2012-08-14
217659 platform Module S jtulach RESO FIXE Cannot find relative path in test on Windows with space in path 2012-09-21
231790 platform Netigso jtulach RESO FIXE Failing test: ExportedIfPresentTest.testCanLoadClassFromContextClassLoaderAsNoExportPackageAvailable 2013-07-03
233436 platform NB JUnit jtulach RESO FIXE NB 7.3.1 tests fail on JDK8 with NoSuchFieldException: declaredMethods 2013-08-19
233443 platform Netigso jtulach RESO FIXE Update Felix: was NB 7.3.1 OSGI related tests fail with org.osgi.framework.BundleException on JDK 8 2013-11-09
238625 platform Module S jtulach RESO FIXE ProxyURLStreamHandlerFactoryTest.testUNCFileURLStreamHandler fails on windows 2013-11-26
112717 javaee Code martin_adamek RESO FIXE testWhenScanFinished blocks testing infrastructure 2007-08-14
173914 debugger Java mentlicher RESO FIXE AssertionError: BaseKit.install() incorrectly called from non-AWT thread. 2009-10-15
179506 debugger Code mentlicher RESO FIXE No writes during startup. 2010-01-14
229438 web CSS Visu mfukala RESO FIXE BrandingAssignedTest.testBrandingIsAssigned test fails due NPE in CssStylesTCController 2013-05-08
139460 xml Schema michaelnazarov RESO FIXE Test compilation failures 2008-07-09
140384 xml Schema michaelnazarov RESO FIXE Random C/V test failures 2008-12-05
133220 xml Schema mikhailmatveev RESO FIXE Uncompilable tests 2008-04-25
140345 ide BlueJ mkleint RESO FIXE Repeatedly failing C/V in trunk production build 2008-07-17
231606 projects Ant mkleint RESO FIXE AntProjectChildrenTest blocks NB-Core-Build 2013-06-21
231784 projects Ant Free mkleint RESO FIXE AssertionFailedError: ran right target expected 2013-06-26
231786 apisuppo Project mkozeny RESO WORK AssertionFailedError: warning message emitted 2013-06-27
115871 ruby Project mkrauskopf RESO FIXE Folder ordering problem 2007-09-19
217397 editor -- Other mkristofic RESO FIXE java.awt.HeadlessException 2012-08-29
234996 platform Text mmetelka RESO FIXE OpenEditorEnablesEditMenuFactoryTest.testIfProjectFactoryInstalled failed seven times in a row 2013-09-11
235319 platform Text mmetelka RESO FIXE ReusableEditor2Test failures. 2013-10-14
140177 obsolete visualwe mschovanek RESO FIXE Test compilation failure 2008-07-17
142835 ide Logger mslama RESO FIXE Test compilation failure 2008-08-05
125251 serverpl Infrastr phejl RESO FIXE Test compilation failure 2008-01-15
154532 groovy Grails phejl RESO DUPL Folder ordering problem 2009-02-19
218075 php Editor phejl RESO FIXE incorrect clusters dependency cause failing tests build 2012-09-11
126653 javaee JSF potingwu RESO DUPL Broken folder ordering 2008-02-04
187023 javacard Java Car psuchomel RESO FIXE Failed C/V tests. testInstantiateAllInstances and testNoWrites 2010-11-29
125612 obsolete visualwe romanmostyka RESO FIXE Uncompilable tests 2008-01-21
134625 obsolete visualwe sandipchitale RESO DUPL InvocationTargetException arises by attempt to create project 2008-05-07
138730 javascri Debugger sandipchitale RESO FIXE Uncompilable tests 2008-07-01
19588 ide Schema2B schema2beans-issues RESO FIXE Switching closed source to use schema2beans caused regression test failure 2003-07-23
45866 java Classfil tball RESO FIXE NPE from Parameter.ParamIterator.<init> common in commit validation 2004-08-13
190692 javacard Java Car tboudreau RESO DUPL CV test org.netbeans.test.ide.GeneralSanityTest.testNoWrites is failing constantly on Windows. 2010-10-08
217971 java Project tzezula RESO FIXE BuildImplTest is causing random build failures 2012-09-15
125211 serverpl Code vkraemer RESO FIXE Test compilation failures 2008-01-14
141022 cnd Editor vkvashin RESO FIXE Test compilation failure 2008-07-21
109038 editor Settings vstejskal RESO FIXE CME from BaseKit$1.settingsChange 2007-11-05
160618 editor Parsing vstejskal RESO FIXE Failed test org.netbeans.junit.NbModuleLogHandler.unknown 2009-03-24
182467 cnd -- Other vv159170 RESO FIXE java.lang.Exception on creating a new project: Should not be called from UI thread 2010-03-23
195014 utilitie Search ynov RESO FIXE Utilities tests are broken by recent commits 2011-02-04
123024 javaee Code abadea RESO FIXE Test compilation failure 2007-12-07
119154 serverpl WebServe ajay_acharya RESO FIXE Folder ordering problems 2007-10-22
122164 php Code akorostelev RESO FIXE Folder ordering problem 2007-12-07
181750 cnd executio akrasny RESO FIXE Missed program output in Output window 2010-03-10
179894 cnd D-Light alexey_vladykin RESO FIXE Remove build warning: [path] bad path element 2010-01-27
167517 cnd Code Mod alexvsimon RESO FIXE Parser's error in Python 2009-06-24
179694 cnd Code Mod alexvsimon RESO FIXE unstable repository unit test CloseAndOpenTest.testCloseAndOpen 2010-01-24
179699 cnd Code Mod alexvsimon RESO FIXE unstable model unit test ExternalModificationTest 2010-01-24
179946 platform NB JUnit alexvsimon RESO FIXE NbTestCase violates contract of method timeOut() 2010-02-03
191244 cnd -- Other alexvsimon RESO FIXE New "C Source File" contains 1 empty line (in studio-ide.tar.bz2 build from elif only) 2010-10-27
221721 cnd Toolchai alexvsimon RESO INVA the variable compiler and interpreter on this system 2012-11-09
214281 platform JDK Prob anebuzelsky RESO DUPL Deadlock on start IDE in automatic tests 2012-06-19
124052 serverpl WebSpher arathi RESO FIXE Layer instantiation problems 2007-12-15
175440 javafx Editor asotona RESO WONT o.n.m.javafx.editor.completion.JavaFXCompletionQueryTest#testCreateEnvironment fails 2011-05-16
130769 webservi Designer bhate RESO WORK ISE during switch from design to source 2008-03-21
143999 javaee EAR dkonecny RESO FIXE EAR project tests are failing because of project.xml validation 2008-08-22
135227 javaee Persiste dongmeic RESO FIXE Test compilation failure 2008-05-16
144247 javaee Persiste dongmeic RESO FIXE Broken tests in web project 2008-08-20
113394 obsolete language dprusa RESO FIXE NPE from EditorParser$MyParserListener.parsed 2007-08-22
79406 platform -- Other dsimonek RESO FIXE Test failure without any given reasons 2008-12-22
87001 platform Window S dsimonek RESO FIXE InitJobTest fails constantly on Windows 2008-12-22
124061 platform Navigato dsimonek RESO FIXE Memory leak via Navigator 2008-12-22
178071 editor Parsing dstrupl RESO FIXE MemoryValidationTest.testGCProjects failure 2011-05-06
92310 javaee Persiste emononen RESO FIXE EntityWizardTest failures 2007-06-21
92512 javaee Persiste emononen RESO FIXE Test failures on JDK 1.5, missing annotations 2007-07-23
94130 javaee EJB emononen RESO FIXE j2ee/ddapi test failures 2009-11-10
98936 javaee Persiste emononen RESO FIXE test failures due to incorrectly generated EntityManagerFactory field 2007-04-19
102310 javaee Persiste emononen RESO FIXE j2ee/persistence test failures due to differences in formatting 2007-07-19
102313 javaee Persiste emononen RESO FIXE JavaPersistenceGeneratorTest failures 2007-07-27
104142 javaee Persiste emononen RESO FIXE Use EntityManager test failures 2007-05-18
112538 javaee Persiste emononen RESO FIXE j2ee/persistence unit tests do not compile 2007-08-27
131093 cnd Debugger gorrus RESO FIXE Folder ordering problem 2009-06-25
192095 cnd Debugger gorrus RESO FIXE On Solaris debugger hangs if full path to executable ~240 or more symbols 2010-11-25
34211 obsolete xtest issues RESO INVA "Unexpected Failure: Suite is not finished" (testDebugging: unknown) during commit validation 2003-12-11
88720 editor Lexer issues RESO FIXE lexer/nbbridge tests are uncompilable 2006-11-08
88854 editor Painting issues RESO FIXE CME from HighlighterImpl.setHighlights 2007-11-05
93614 versionc Subversi issues RESO FIXE Either fix or remove tests from stable test suite 2007-01-31
93645 java Unsuppor issues RESO DUPL Either fix or remove tests from stable test suite 2007-09-26
94901 java Refactor issues RESO FIXE NSEE from UndoManager.addItem 2007-08-14
115452 editor -- Other issues RESO FIXE Tests building error editor/codetemplates 2007-11-05
117857 obsolete language issues RESO FIXE Folder ordering problem 2007-10-05
120735 obsolete language issues RESO DUPL Folder ordering problem 2007-11-01
124713 editor Refactor issues RESO FIXE Memory leak in some refactoring cache 2008-01-24
129781 versionc Mercuria issues RESO FIXE HgUtils.isIgnored passes null to ProjectManager.isProject 2009-05-12
136925 uml Project issues RESO INVA Regression in Open UML Project time 2008-06-10
137882 editor Settings issues RESO FIXE NPE from BaseDocument$1.preferenceChange 2008-11-06
144410 editor Settings issues RESO FIXE Unable to call the test target form the commandline without an X server running. 2008-08-21
154957 editor Parsing issues RESO FIXE FileNotFoundException at org.netbeans.modules.masterfs.filebasedfs.fileobjects.FileObj$2 2009-02-19
156018 editor -- Other issues RESO FIXE org.netbeans.modules.web.core.syntax classes are loaded during NetBeans startup with LimeWire project 2009-09-13
157430 editor -- Other issues RESO FIXE OptionsPanel loaded on NetBeans startup 2009-02-19
166173 editor CSL (API issues RESO FIXE Can't run tests due to "Waiting for classpath scanning to finish timed out" 2009-06-04
168789 versionc Mercuria issues RESO FIXE Commit validation fails randomly 2009-07-23
179532 editor Settings issues RESO FIXE Editor detect wrong Editor Kit in cnd tests 2010-02-03
183368 editor Painting issues RESO DUPL Error in RequestProcessor org.netbeans.modules.editor.impl.highlighting.AnnotationsHighlighting$1 2010-04-04
194649 guibuild Code issues RESO DUPL Deadlock while opening a form 2011-02-03
134278 xml XSL ivansidorkin RESO WORK Test failure in AcceptanceTestCase.editXSLT: "TimeoutExpiredException: Scrolling" 2008-07-29
147870 db Derby jbaker RESO DUPL sample DB not found in tests 2008-10-10
114270 obsolete visualwe jbisso RESO FIXE Empty XML layer 2007-08-30
48771 projects Ant jglick RESO DUPL Commit Validation fails on windows 2004-09-10
58145 projects Ant Free jglick RESO FIXE Unevaluated test failures in ant/freeform 2005-09-05
61283 projects Ant Free jglick RESO FIXE Several ant/freeform tests failed (*.xml was not text.xml) 2005-09-05
62680 platform -- Other jglick RESO FIXE XMLUtil test fails on windows 2008-12-22
68260 platform Data Sys jglick RESO FIXE Test failures due to changes since Nov 03 - Nov 06 2008-12-22
87544 projects Generic jglick RESO FIXE "IAE: Called DataObject.find on null" passing nonexistent path to LookupProviderSupport.createCompositeLookup 2006-10-23
88772 platform Module S jglick RESO FIXE ModuleFactoryTest 2008-12-23
104492 apisuppo Project jglick RESO FIXE NPE in many tests 2007-05-23
107995 apisuppo Project jglick RESO FIXE Various test failures in apisupport 2007-07-27
108023 apisuppo Project jglick RESO FIXE OutOfMemory in SuitePropertiesTest 2007-06-28
139048 projects Ant jglick RESO WORK misconfigured XML parser factory for qa-functional tests 2009-01-21
192590 apisuppo Project jglick RESO FIXE Too many open files in LayerUtilsTest 2010-12-02
127368 platform Help Sys jhavlin RESO FIXE IllegalArgumentException: view is invalid 2012-09-13
233351 connecte Hudson jhavlin RESO FIXE NullPointerException at HudsonInstanceImplTest.testIgnoreNullListener(HudsonInstanceImplTest.java:208) 2013-07-26
234610 platform Filesyst jhavlin RESO WORK NB 7.3.1 tests InstallTmpModuleTest fails on JDK 8 with UnsatisfiedLinkError 2013-08-23
88719 java Editor jiriprox RESO FIXE java/editor qa-functional tests are uncompilable 2006-11-07
115458 java Editor jiriprox RESO FIXE Failed to build qa-functional tests java/editor 2007-09-13
68866 platform Options& jjancura RESO FIXE Failures in org.netbeans.core.projects.ValidateLayerConsistencyTesttestAreAttributesFine,testValidShadows 2008-12-23
58141 java Freeform jlahoda RESO FIXE A lot of Unevaluated Failing tests 2005-09-05
73188 projects Generic jlahoda RESO FIXE OpenProjectListTest failing on 1.5 non-windows platforms 2006-10-23
93646 java Hints jlahoda RESO FIXE Either fix or remove tests from stable test suite 2007-02-13
110821 editor Hints & jlahoda RESO FIXE BLE from AnnotationHolder$3.run 2007-11-05
117175 java Hints jlahoda RESO FIXE Test compilation failure 2007-09-30
121249 java Hints jlahoda RESO FIXE Broken test compilation 2007-12-07
122563 obsolete visualwe joellelam RESO FIXE Broken test compilation 2007-12-07
176013 connecte Team Fra joshis RESO FIXE MemoryValidationTest.testGCProjects failure from KenaiPopupMenu 2009-11-10
229398 platform Explorer JPESKA RESO WORK Stabilize BeanTreeViewTest, breaks the team builds randomly 2013-06-06
235739 platform Actions JPESKA RESO FIXE NbKeyMapTest fails on Solaris 2013-09-17
128265 java Javadoc jpokorsky RESO WORK Memory leak when create/close NbModuleProject 2008-03-19
139232 java Javadoc jpokorsky RESO DUPL IllegalStateException: '' org.netbeans.modules.java.editor.javadoc.DocPositions@1d6213a token sequence dump: T[0]: "\n *\n * " <571,578> OTHER_TEXT[5] DefT, IHC=32675456 *[1]: "@author" <578,585> TAG[ 2008-07-08
62732 projects Generic jrechtacek RESO FIXE LookupSensitiveAction failure 2005-09-15
79897 platform -- Other jrechtacek RESO WORK Failed org.netbeans.core.HttpSettingsTest and org.netbeans.core.NonProxyHostsTest 2008-12-22
91315 platform -- Other jrechtacek RESO FIXE HttpSettingsTest sometime fails 2008-12-22
107975 platform Autoupda jrechtacek RESO WORK failing tests 2007-08-10
142928 platform Dialogs& jrechtacek RESO WONT First project created using NewProjectWizardOperator not opened in project window 2009-11-02
211723 platform Autoupda jrechtacek RESO FIXE TargetClusterTest.testInstallNewIntoDeclaredNextCluster fails. 2012-04-25
115733 javaee JSP jsedek RESO DUPL Broken test compilation 2007-09-18
34595 qa Jellytoo jskrivanek RESO FIXE IDEValidation.testDebugging validation test failure 2003-07-23
78955 java JUnit jskrivanek RESO DUPL Failing commit validation in JUnit test 2007-08-27
228568 qa Jellytoo jskrivanek RESO FIXE EIIE at org.netbeans.jellytools.OutputOperator.<clinit> 2013-04-16
71852 apisuppo Project jtulach RESO FIXE GenerateJNLPApplicationTest.testItIsPossibleToGenerateStaticRepository() is failing 2006-01-25
72593 platform Module S jtulach RESO WORK InstanceDataObjectModuleTest2 2008-12-23
72594 platform Module S jtulach RESO WONT InstanceDataObjectModuleTest4 2008-12-23
72677 platform Data Sys jtulach RESO FIXE CanYouQueryFromRenameTest 2008-12-22
73377 platform Data Sys jtulach RESO WORK Concurent modification error MultiDataObjectTest 2008-12-22
74193 platform Data Sys jtulach RESO FIXE testDataObjectsCreatedOncePerFile: 2008-12-22
74996 platform -- Other jtulach RESO FIXE TopLogging tests fail on windows 2008-12-22
84674 platform Data Sys jtulach RESO WORK testConsistencyWithContinuousQueryingForDeletedFiles 2008-12-23
84677 platform -- Other jtulach RESO WORK testShortcutsForDifferentFilesThanInstanceOrShadows 2008-12-23
84873 platform Data Sys jtulach RESO FIXE Logging control starvates on Windows 2008-12-22
85224 platform Data Sys jtulach RESO FIXE Random memory leak in DataShadowSlowness39981Test 2008-12-22
85225 platform Data Sys jtulach RESO WORK Random failure in org.openide.awt.ToolbarPoolTest 2008-12-22
85868 platform Data Sys jtulach RESO WORK Some suites did not finish correctly:org.openide.awt.MenuBarTest 2008-12-22
86652 platform -- Other jtulach RESO FIXE NbDelayedTest failure 2008-12-22
87227 platform -- Other jtulach RESO FIXE Failure in CLIHandlerRemembersSystemInOutErrTest 2008-12-22
87770 platform -- Other jtulach RESO WONT Deadlock in DefaultDataObjectHasOpenTest tests 2008-12-22
87788 platform Nodes jtulach RESO FIXE Failure in ChildrenKeysTest 2008-12-22
91867 platform Window S jtulach RESO FIXE Deadlock in NbClipboardTest 2008-12-22
91868 www Builds & jtulach RESO FIXE MakeJNLPTest fails constantly on windows 2007-02-22
94319 obsolete xtest jtulach RESO FIXE Some incompatibility between 1.5.0_10 and 1.5.0_11 2007-08-20
100936 apisuppo Harness jtulach RESO FIXE Some problems with JNLP building 2007-06-29
102990 platform Data Sys jtulach RESO WORK Deadlock in qa functional tests (testSwingFormManipulation) on Solaris 2008-12-22
123644 contrib RemoteFS jtulach RESO FIXE Folder ordering problem 2007-12-14
124712 projects Generic jtulach RESO FIXE Memory leak in projects bagging node 2008-01-16
124716 platform Explorer jtulach RESO FIXE Memory leak in main explorer 2008-12-22
160537 platform Lookup jtulach RESO DUPL StackOverflowError when running tests 2009-03-21
168177 xml Code jtulach RESO FIXE Generated scanner.java file not opened in editor after generating it 2009-07-23
168181 platform Window S jtulach RESO FIXE testGCDocuments test failed 2009-07-12
175325 platform NB JUnit jtulach RESO WORK Class loading problem in NbModuleSuite 2009-11-05
179507 platform Filesyst jtulach RESO WONT FileUtil should not init UI 2010-01-16
179787 platform Filesyst jtulach RESO FIXE java.io.InterruptedIOException while opening C/C++ project 2010-02-11
185945 platform Module S jtulach RESO FIXE Random-looking GeneralSanityTest.testNoWrites failure 2010-05-17
198270 platform Data Sys jtulach RESO WORK Deadlock in DataLoaderInLayerOnSFSTest.testSimpleGetChildren 2011-05-27
200848 platform Filesyst jtulach RESO FIXE XML layers from classpath discarded after LookupEvent on FileSystem 2011-09-30
206468 platform Netigso jtulach RESO FIXE Tests fail on exception: NPE: org.eclipse.core.internal.net.ProxyManager 2012-06-11
210567 platform Netigso jtulach RESO FIXE Test failures involving Felix bundle cache lock 2012-04-27
211705 platform Module S jtulach RESO WORK java.lang.IllegalStateException: Too many org.openide.util.RequestProcessorParallelTest$Para (3) in shared RequestProcessor; create your own 2012-05-02
221608 platform Module S jtulach RESO DUPL org.osgi.framework.BundleException: The bundle "org.eclipse.core.contenttype_3.4.100.v20100505-1235 [174]" could not be resolved. Reason: Missing Constraint: Require-Bundle: org.eclipse.equinox.prefer 2013-05-16
224705 platform Filesyst jtulach RESO WORK failing tests: BaseFileObjectTestHid.testFileUtilToFileObjectIsValid 2013-03-21
227918 platform Text jtulach RESO FIXE CloneableEditorSupportTest.testDocumentIsNotGCedIfOpenedInEditor may crash JDK7 VM 2013-08-09
233425 platform JDK Prob jtulach RESO FIXE Shutdown starvation in test execution 2014-01-06
234608 platform Netigso jtulach RESO DUPL NB 7.3.1 tests NetigsoUsesSwingTest fails on JDK 8 with No module could be enabled 2013-08-28
115460 platform Autoupda juhrik RESO FIXE Failed to build tests ide/updatecenters 2007-09-13
132729 javame Visual D kharezlak RESO INVA Mobility tests freeze 2009-09-18
141222 javame Visual D kharezlak RESO FIXE Folder ordering problem 2008-07-28
95491 qa Code krystyna RESO WONT Gravy: hang if making more than one add/dndPalette call from "Composite" palette 2009-07-07
46497 qa Code lcincura RESO FIXE Test testExceptionBreakpoint fails 2005-03-19
70460 javaee Refactor madamek RESO FIXE testPrepare error current thread not owner 2006-01-03
95940 javaee EJB madamek RESO FIXE Failing test - not found template in wzard 2007-03-19
96413 javaee EJB madamek RESO FIXE Critical error in test 2007-03-20
98316 javaee EJB madamek RESO FIXE Cannot get exclusive access to ejb-jar.xml in tests 2007-03-20
117040 obsolete visualwe markdey RESO FIXE Remove empty layer 2007-09-28
95404 javaee EJB martin_adamek RESO FIXE Failing tests because of wrong link to javaee API jar 2007-06-19
107049 javaee EJB martin_adamek RESO WORK TopologicalSortException after opening project node 2007-06-20
116842 javaee Code martin_adamek RESO FIXE Test compilation failure 2007-09-26
120538 javaee Code martin_adamek RESO FIXE Test compilation failure 2007-10-30
47584 utilitie Diff mentlicher RESO WONT EditablePropertiesTest file comparisons are platform-dependent 2005-11-15
199367 debugger Code mentlicher RESO FIXE debugger.jpda unit tests do not run (hang) 2011-06-18
223093 debugger Java mentlicher RESO FIXE ValidateLayerMenuTest.testContentCorrect: KillAction.shadow] does not provide correct instance 2012-12-18
229400 ide Logger mentlicher RESO FIXE Stabilize uihandler.AutoSubmitTest and uihandler.InstallerTest, breaks the team builds randomly 2013-06-02
229657 debugger Code mentlicher RESO FIXE Line breakpoint ignored in the first debugging session upon IDE startup 2013-06-28
231182 platform Data Sys mentlicher RESO FIXE NullPointerException at org.openide.loaders.FolderInstance$HoldInstance.toString(FolderInstance.java:1174) 2013-06-14
231254 platform Explorer mentlicher RESO FIXE OutOfMemoryError in org.openide.explorer.view.TreeViewTest 2013-07-01
166634 javascri Editor mfukala RESO INCO Templates/JSP_Servlet/javascript.shadow and Templates/JSP_Servlet/json.shadow are not valid DataShadows. 2009-07-23
120125 webservi WSIT mgrebac RESO FIXE Test compilation failure 2007-10-26
123926 webservi WSIT mgrebac RESO FIXE Broken test compilation 2007-12-13
133488 xml JAXB mikhailmatveev RESO DUPL Uncompilable tests 2008-04-25
95968 apisuppo Project mkleint RESO FIXE apisupport tests uncompilable 2007-02-20
101227 projects Generic mkleint RESO FIXE ProjectChooserAccessoryTest uncompilable 2007-04-30
130921 projects Generic mkleint RESO FIXE Test compilation failure 2008-03-25
228114 projects Maven mkleint RESO FIXE ActionProviderImplTest.testRunSingleMethodEnabledWhenHaveCoS fails 2013-03-30
70914 apisuppo Project mkrauskopf RESO FIXE SuiteLogicalViewTest.testModulesNode failure 2006-01-11
72200 apisuppo Project mkrauskopf RESO FIXE Deadlock in GUIRegistrationPanelTest 2006-02-13
72620 apisuppo Project mkrauskopf RESO FIXE ModuleLogicalViewTest.testImportantFilesListening fails 2006-02-14
79489 javaee EAR mkrauskopf RESO FIXE Test failure in ear project - NoClassDefFoundError 2006-06-30
81314 javaee EAR mkrauskopf RESO FIXE ImportBlueprintEarWizardIteratorTest fails 2006-07-28
83921 javaee EAR mkrauskopf RESO FIXE NewEarProjectWizardIteratorTest.testTestableInstantiateWithWebAndEJBAppClient(): broken due to 82061 2006-08-31
87975 apisuppo Project mkrauskopf RESO FIXE SubprojectProviderImplTest fails 2006-11-03
153607 ruby Project mkrauskopf RESO FIXE Failing LogicalViewProviders tests 2009-02-19
93297 java Freeform mkubec RESO FIXE Remove dependency on test datadir of other project 2007-02-20
99665 java Freeform mkubec RESO FIXE Java FreeForm tests blocks daily test run 2007-04-02
124054 projects Generic mkubec RESO FIXE Memory leak in files view 2008-01-14
124711 projects Generic mkubec RESO DUPL Memory leak in project wizard 2008-01-16
142067 webservi Designer mkuchtiak RESO FIXE deadlock while creating WS 2008-07-30
155125 webservi REST mkuchtiak RESO FIXE rest ws from patterns created in a wrong source root 2009-04-09
50979 java Unsuppor mmatula RESO FIXE NPE from SourceElementImpl.getClass during commit validation 2004-11-09
100753 java Hints mmetelka RESO FIXE Last editor held by HintsUI.INSTANCE 2008-03-10
238872 platform Text mmetelka RESO FIXE NotifyModifiedTest.testReloadWhenModifiedIssue57104 is breaking a build. 2013-11-27
93778 utilitie Search mpetras RESO FIXE Failing tests in search API 2007-07-26
179900 cnd D-Light mromashova RESO FIXE Fix new deprecated warnings in classes GizmoRunActionHandler and DLightRunExecutableAction 2010-01-27
159658 java Source msauer RESO DUPL Tests can not be compiled 2009-03-19
168037 javaee JSF mschovanek RESO FIXE web.jsf test compilation failing 2009-07-20
132442 platform Text mslama RESO WONT Tests randomly failing because EditorCookie.openDocument() == null 2008-12-22
146008 platform Text mslama RESO FIXE no document although status is 2; doc=StrongRef[doc=null,super.get=null] 2009-02-19
152839 platform Text mslama RESO FIXE no document although status is 2; doc=StrongRef[doc=null,super.get=null] 2009-02-19
167541 editor CSL (API mslama RESO FIXE Caret position marker not stripped off in CslTestBase#computeHints 2009-07-03
141973 www Builds & nbbuild-issues RESO FIXE deadlock/trunk runs old-looking VW tests 2009-07-03
114210 serverpl Sun Apps pcw RESO FIXE testEarProjectIsGCed fails 2007-09-20
118278 java Hints pflaska RESO FIXE Uncompilable tests 2007-10-09
115457 serverpl JBoss phejl RESO FIXE Failed to build qa-functional tests - serverplugins/jboss4/ 2007-09-18
120743 serverpl WebSpher phejl RESO FIXE Folder ordering problems 2007-11-01
133138 javaee Code phejl RESO FIXE Test compilation failure 2008-04-25
177841 serverpl Code phejl RESO DUPL Do not ask for server plugin when server is not installed 2010-02-10
233096 javascri Formatti phejl RESO FIXE org.netbeans.modules.php.editor.js.JsFormatterEmbeddedTest failing 2013-07-24
234612 javascri Editor phejl RESO DUPL NB 7.3.1 tests ImportDataCreatorTest.testImportData_01 fails on JDK 8 by timeout 2014-01-15
42283 projects Generic phrebejk RESO FIXE Context-sensitive project actions must have unit tests 2004-08-13
79683 ide Internal pjiricka RESO FIXE HTTPserver module tests cannot be executed 2007-02-22
40890 platform -- Other pnejedly RESO FIXE MutexTest is showing exception boxes 2008-12-22
60215 platform Nodes pnejedly RESO FIXE Constant failures in testSetIconBaseWithExtension 2008-12-22
72602 platform Explorer pnejedly RESO FIXE TreeView48993Test 2008-12-22
79407 platform -- Other pnejedly RESO FIXE Deadlock in TaskThreadGroupGCTest 2008-12-22
84676 platform Nodes pnejedly RESO FIXE ChildrenKeysTest.waitOn starvation 2008-12-23
108022 platform Nodes pnejedly RESO WORK testParentAssigned randomly fails on Linux 2008-12-22
115048 javaee Code ppisl RESO FIXE Uncompilable unit tests 2007-09-14
115447 javaee Code ppisl RESO FIXE Failed to build tests - web/webapi 2007-09-14
115455 javaee JSP Pars ppisl RESO FIXE Failed to build tests - web/jspparser 2007-09-14
120740 javaee JSP Pars ppisl RESO DUPL NPE from JspParserImpl.initReflection 2007-11-01
95050 javaee Struts ptymoshenko RESO INVA Test testGetActionPath and testGetActionFormBeanName fails due NoClassDefFound 2007-08-21
105170 javaee Code ptymoshenko RESO FIXE IDE freezes ta TagHandlerPanelGUI.browseButtonActionPerformed():443 2010-01-12
83185 apisuppo Harness pzajac RESO FIXE editor unit tests are uncompilable 2006-11-03
115461 javaee JSP pzajac RESO FIXE Failed to build qa-functional tests 2007-09-18
138642 webservi JAX-WS rcruz RESO FIXE IllegalStateEx when adding WebServiceClient, sometimes deadlock 2008-08-13
46637 platform Filesyst rmatous RESO FIXE MasterFileObject sometimes fails to fire fileFolderCreated on recently deleted & (on-disk) recreated folder depending on memory conditions 2008-12-22
53714 platform Filesyst rmatous RESO DUPL [tests] core validation tests fail with IOException: Too many open files 2008-12-22
54612 platform -- Other rmatous RESO WORK Tests for core/settings are failing on linux and solaris 2008-12-22
55045 platform -- Other rmatous RESO FIXE some problem with settings on 1.5.0_03 2008-12-22
58331 platform Filesyst rmatous RESO FIXE MemoryFileSystem is fragile 2008-12-22
66208 platform Filesyst rmatous RESO WORK MemoryFileSystem.fileAlreadyExists 2008-12-22
67385 platform Filesyst rmatous RESO FIXE Wrong synchronization in MemoryFS 2008-12-22
68077 platform Filesyst rmatous RESO FIXE MimeSupport is likely a bit fragile 2008-12-22
70654 platform Filesyst rmatous RESO FIXE JarFileSystemTest.testGetURL failure 2008-12-22
73799 platform -- Other rmatous RESO FIXE failing test SerialDataConvertorTest.test50177ProblemSimulation 2008-12-22
74999 platform Filesyst rmatous RESO FIXE org.openide.filesystems. MIMESupport69049Test 2008-12-22
80002 platform -- Other rmatous RESO WONT failing SerialDataConvertorTest.test50177ProblemSimulation 2008-12-22
82593 platform Filesyst rmatous RESO FIXE testSimulatesRefactoringRename fails on Windows 2008-12-22
83158 platform Filesyst rmatous RESO FIXE Cannot create file testfile.txe in folder /. This file already exists. 2008-12-22
83353 platform Filesyst rmatous RESO WONT Master FS test failures in 5.5 2008-12-22
84698 platform Filesyst rmatous RESO WORK FileBasedFileSystemTest.testLock fails 2008-12-22
84699 platform Filesyst rmatous RESO FIXE MIMESupport69049Test.testProblemWithRecursionInIssue69049 fails 2008-12-23
86582 platform Filesyst rmatous RESO FIXE FolderObjTest.testSimulatesRefactoring fails 2008-12-22
98227 platform Filesyst rmatous RESO FIXE Deadlock-prone call to EventQueue.invokeAndWait from FileUtil.getFileSystemView 2008-12-22
98388 platform Filesyst rmatous RESO FIXE IllegalArgumentException: Expected scheme-specific part at index 5: file: [file:] 2008-12-22
102783 ide Code rmatous RESO FIXE org.netbeans.upgrade.CopyTest fails 2007-07-12
115448 platform Options& rmatous RESO FIXE Failed to build tests - core/options/keymap 2008-12-22
120736 platform Options& rmatous RESO DUPL CME from KeymapModel.getCurrentProfile 2008-12-22
133487 xml Schema samaresh RESO FIXE Uncompilable tests 2008-04-25
120540 obsolete visualwe sandipchitale RESO DUPL NPE from insync.java.ReadTaskWrapper.execute 2007-10-30
124715 java Navigati sandipchitale RESO DUPL Memory leak in java caret listening factory 2008-01-08
61018 platform Palette saubrecht RESO FIXE Palette: Tests for DataObject mapping 2008-12-22
123918 platform Explorer saubrecht RESO FIXE Memory leak in org.openide.explorer.propertysheet.PropertyDialogManager 2008-12-22
154618 platform Action I saubrecht RESO WONT 872 new violators for NetBeans startup with LimeWire project 2009-02-19
178592 platform Window S saubrecht RESO FIXE MemoryValidationTest.testGCDocuments failure 2010-02-03
189900 platform Window S saubrecht RESO FIXE Not all objects GCed 2010-10-15
218944 platform Property saubrecht RESO WORK org.openide.explorer.propertysheet.EnumPropertyEditorTest fails on Windows JDK7 2012-09-26
227526 platform -- Other saubrecht RESO WONT Is UIManager call in ImageUtilties violation of UIManager contract? 2013-03-15
231212 platform Window S saubrecht RESO FIXE AssertionFailedError at org.openide.windows.TopComponentTest.testToStringOfDelegateContainsNameOfOriginalAction(TopComponentTest.java:277) 2013-06-27
232918 platform Data Sys saubrecht RESO FIXE MenuBarNotInAWTTest.testCreateAndWait test is failing 2013-07-31
133115 uml Diagram sj-nb RESO FIXE Time to create sequence diagram from 30 nodes exceeds threshold 2008-10-12
120741 soa XSLT slunegov RESO DUPL NPE from xslt.project.wizard.element.Util.copyFile 2007-11-01
175439 javafx Editor sunflower RESO WONT o.n.m.javafx.editor.format.FormattingTest#testVariable fails 2011-05-16
134053 javame -- Other tboudreau RESO FIXE Freeze on finish New Mobility Project 2008-10-09
147403 javame CDC pack tboudreau RESO FIXE Regression of Create Mobility Project action on WinXP and WinVista 2008-10-07
182637 platform -- Other tboudreau RESO FIXE Not all 1000 threads should have completed, but 1000 did. 2010-04-02
215148 java JUnit theofanis RESO WORK "no tests executed" when debugging tests or relaunching failed tests 2012-08-21
125722 javaee EAR tmysik RESO DUPL Failing tests because of java.lang.AssertionError 2008-02-22
128158 java Project tmysik RESO FIXE Memory leak in UpdateHelper 2008-02-27
104040 ruby Code tor RESO FIXE ruby/rake tests are uncompilable 2007-07-03
128933 editor CSL (API tor RESO DUPL IAE: A node selection cannot contain nodes (html) not underneath the root 2009-02-19
132422 editor CSL (API tor RESO FIXE Various tests uncompilable 2009-02-19
133090 ruby Rails tor RESO FIXE MigrateActionTest#testMigrateUTCMany fails 2008-06-20
229405 versionc Code tstupka RESO FIXE Stabilize VCSContextTest, breaks the team builds randomly 2013-05-07
58143 projects Librarie tzezula RESO FIXE Failures in org.netbeans.modules.project.libraries.LibrariesStorageTest 2005-09-05
58144 java Project tzezula RESO FIXE Unevaluated test failures in PackageViewTest, etc. 2005-09-05
97114 java Source tzezula RESO FIXE Deadlock in GlobalSourcePathTest.testRaceCondition2 2007-03-02
99737 java Source tzezula RESO FIXE Assertion error thrown from tests 2007-05-11
124055 java Classpat tzezula RESO FIXE Memory leak in GlobalSourcePath 2008-01-29
146410 java Navigati tzezula RESO FIXE IDEValidation.testGCDocuments failures 2008-09-12
167639 java Project tzezula RESO INVA com.sun.org.apache.* classes shouldn't be loaded on nb startup with j2se project 2009-09-09
211021 editor Parsing tzezula RESO FIXE RepositoryUpdaterTest fails due to ClassPath.equals 2012-04-13
174741 platform Nodes t_h RESO FIXE Memory leak in ChildrenArray's map 2009-10-16
108629 serverpl Sun Apps vkraemer RESO FIXE AssertionFailedError: project cannot be garbage collected 2007-07-16
230463 cnd Remote vkvashin RESO WORK sometimes IDE can't create "full remote" project 2013-08-06
230539 cnd Remote vkvashin RESO FIXE NPE while creation a full remote project 2013-06-25
233858 cnd Remote vkvashin RESO FIXE Massive full remote test failures due to NPE in New Project with existing source wizard 2013-08-08
233860 cnd Remote vkvashin RESO FIXE OutOfMemoryError in new full remote project wizard 2013-08-08
93005 editor -- Other vstejskal RESO FIXE Add build-unit.xml ant task to to editor/lib/test 2007-11-05
120537 editor Formatti vstejskal RESO FIXE Broken AU from editor.indent/1 -> /0 change 2007-11-15
155286 editor Completi vstejskal RESO FIXE editor.deprecated.pre61completion module now unused 2009-03-20
179788 editor Parsing vstejskal RESO DUPL java.lang.IllegalArgumentException while opening C/C++ project 2010-02-01
179695 cnd Code Mod vv159170 RESO FIXE ConcurrentModificationException after last changes in FileImpl 2010-02-15
179729 cnd Code Mod vv159170 RESO FIXE unstable model tests based on resolver_class_string.cc 2010-01-25
179861 cnd Code Mod vv159170 RESO FIXE unstable test RepositoryValidation 2010-09-23
191511 cnd Navigati vv159170 RESO FIXE "Change Function Parameters" and "Rename" menu items doesn't work in Navigator tab 2010-11-02
224942 cnd Code Mod vv159170 RESO FIXE Unit test UnresolvedCpp11IdentifierTest.testBug214185 is failed on Windows since January, 9 2013-01-23
211756 java Freeform yardus RESO FIXE Broken tests JavaActionsTest.testCreateProfileTargetFromScratch and JavaActionsTest.testCreateProfileTargetFromTemplate 2012-04-27
75204 db Code abadea RESO FIXE Some tests of the db module fail 2008-09-20
81585 db Derby abadea RESO FIXE Tests in the db/derby module fail 2006-08-01
87666 db SQL Edit abadea RESO FIXE Tests in the db/core module fail 2006-10-23
90762 java Project abadea RESO FIXE Failure of J2SEPersistenceProviderTest 2007-10-04
96310 obsolete EJB Free abadea RESO WONT ClassPathTest in j2ee/ejbfreeform fails 2007-07-04
100024 obsolete EJB Free abadea RESO WONT j2ee/ejbfreeform tests fail 2007-07-04
101295 javaee Code abadea RESO FIXE (EjbJar|Web)PersistenceProviderTest fails 2007-10-30
105034 javaee Code abadea RESO FIXE PersistentObjectManagerMultipleTest.testChangedFiles fails 2007-06-26
111737 javaee Code abadea RESO FIXE PersistentObjectManagerMultipleTest fails 2007-10-30
115334 db Code abadea RESO FIXE DbMetaDataListenerImplTest fails 2007-09-12
116701 javaee Code abadea RESO FIXE WebModuleExtenderBridgeTest fails 2007-09-25
117344 db Code abadea RESO FIXE DatabaseConnectionConvertorTest fails 2007-10-01
120447 db SQL Edit abadea RESO FIXE SQLEditorSupport tests fail 2007-10-30
160010 javame -- Other ads RESO FIXE NPE in RicohDeploymentProperties 2009-03-18
194638 javaee Code ads RESO FIXE WebInjectionTargetQueryImplementationTest.testIsInjectionTarget test failing 2011-01-27
200973 webservi Code ads RESO FIXE WebServiceClientCreatorTest.testJ2SEonJdk6 fails 2011-08-16
184421 cnd executio akrasny RESO WONT random failures in JSch 2012-10-30
185442 cnd executio akrasny RESO WORK hung jvms on ssi-test-sparc 2010-12-22
188122 cnd executio akrasny RESO FIXE windows7 can't find "dorun.sh",I can't run any program,but I can run it in debug mode. 2012-04-23
188491 cnd executio akrasny RESO WORK NPE in NativeProcessBuilderTest 2010-08-16
190414 cnd D-Light akrasny RESO FIXE Unstable IndicatorTickerServiceTest 2010-09-18
173048 cnd executio alexey_vladykin RESO FIXE Fix nativeexecution tests 2010-04-19
175541 cnd -- Other alexey_vladykin RESO FIXE tests on ssi-test-sparc time out 2009-10-28
176197 cnd Code Mod alexey_vladykin RESO FIXE parser recovery test fails 2009-11-09
165014 cnd -- Other alexvsimon RESO FIXE Regression in org.openide.filesystems.FileUtil.getConfigFile() 2009-05-14
165147 cnd Editor alexvsimon RESO FIXE failed unit test BracketCompletionTestCase.testBreakLineInString3 2009-05-14
166078 cnd Code Mod alexvsimon RESO FIXE Sometimes CsmHyperlinkTest hangs 2009-05-28
166609 cnd -- Other alexvsimon RESO FIXE MemoryCacheTest fails on Windows XP 2010-02-04
190638 cnd Project alexvsimon RESO FIXE Discovery tests hang sometime 2010-10-13
227778 platform JDK Prob anebuzelsky RESO WONT A deadlock in NetigsoOSGiAutoloadActivationVisibleTest 2013-07-10
238865 platform JDK Prob anebuzelsky RESO WONT Couple ergonomics tests failed due "Forked Java VM exited abnormally" 2013-11-29
177726 javafx Platform asotona RESO WONT javafx.project's module test are completely broken 2011-05-16
174713 platform Text cyhelsky RESO FIXE Leaking Document when editor is not opened (but also not closed) 2013-07-22
105028 db Code davidvc RESO FIXE DataTypeTest.testData fails 2008-01-23
117894 db Code davidvc RESO FIXE DatabaseExplorerUIsTest fails 2008-03-17
98776 javaee EAR dkonecny RESO FIXE NPE in unit tests on WinXP 2008-03-10
102229 javaee App Clie dkonecny RESO FIXE Make j2ee/appclient unit tests stable 2009-09-22
105270 javaee EAR dkonecny RESO FIXE NPE in testPathInEARChangingJ2EE 2008-03-10
108393 javaee EAR dkonecny RESO FIXE NPE in NewEarProjectWizardIteratorTest 2008-03-10
112433 javaee EJB Proj dkonecny RESO FIXE SourcePathImplAddonsTest fails 2009-07-28
128305 javaee EAR dkonecny RESO FIXE DD not reflect modules added with addEjbJarModule 2008-02-28
142545 javaee Web Proj dkonecny RESO DUPL Unable to create a web application 2008-08-07
194637 javaee Code dkonecny RESO FIXE j2ee.core.utilities test failing 2011-01-25
105031 javaee Persiste dongmeic RESO WORK EntityMappingsMetadataModelCompatibilityTest test cases fail 2009-02-19
174686 debugger Java dprusa RESO FIXE Memory leak in FiltersDescriptor 2010-02-06
68407 platform Window S dsimonek RESO FIXE org.netbeans.core.windows.services.ActionCopyPasteTest failing 2008-12-22
120762 platform Window S dsimonek RESO FIXE [60cat] Close All Documents disabled 2008-12-22
133687 platform Window S dsimonek RESO DUPL Incorrect use of Windows API is reported 2008-12-22
133698 platform Window S dsimonek RESO DUPL Incorrect use of Windows API is reported 2008-12-22
159974 editor CSL (API dstrupl RESO WONT AssertionError at org.netbeans.editor.BaseCaret.install 2010-09-30
170371 editor Key bind dstrupl RESO FIXE Duplicate shortcut 'D-SPACE' definition 2010-10-07
171867 editor Settings dstrupl RESO WONT Memory leak: Indentation cache holds on closed project 2010-10-01
172275 editor CSL (API dstrupl RESO INCO Random hint test failures 2010-09-24
172354 editor CSL (API dstrupl RESO INCO Classpath scanning time outs in tests 2010-09-24
71581 javaee Refactor emononen RESO WONT J2EEMoveClassRefactoringTest fails occasionally 2007-06-26
72768 javaee Refactor emononen RESO FIXE J2EERenameRefactoringTest fails 2006-06-04
72991 javaee EJB emononen RESO DUPL Locking problem in DDEditorTest 2009-11-10
73490 javaee Refactor emononen RESO WONT J2EERenameRefactoringTest failure 2007-06-26
73592 javaee Persiste emononen RESO DUPL PersistenceUnitDataObjectTest#addMultiple classes failed on SunOs 2006-06-04
74226 javaee Persiste emononen RESO FIXE PersitenceUnitDataObjectTest failure 2006-08-25
75378 javaee Refactor emononen RESO WONT j2ee/refactoring test failures 2007-06-26
76080 javaee Refactor emononen RESO DUPL J2EERenameRefactoringTest#testTldRenameClass caused error, test run 200605050500 2006-09-01
92311 javaee Persiste emononen RESO FIXE EjbFacadeWizardIteratorTest failures 2007-08-17
93318 javaee EJB emononen RESO FIXE Use getDataDir() in tests 2009-11-10
96540 javaee EJB emononen RESO FIXE Unknown test failures in j2ee/ddloaders 2009-11-10
125902 ruby Rails emononen RESO FIXE Rails project test failures 2008-07-29
131142 ruby Platform emononen RESO FIXE testRepositoriesAreStored fails 2009-08-25
148080 ruby Project emononen RESO INCO org.netbeans.api.ruby.platform.RubyPlatform is loaded on NetBeans startup with LimeWire project 2009-05-22
181984 ruby Project emononen RESO FIXE JUnit test fails - regression for issue 114387 2010-03-29
125614 obsolete language geertjan RESO WONT IAE from DG.addNode in DGUtils.merge 2010-10-18
190458 cnd executio gorrus RESO FIXE Unstable tests due to "Auth fail" 2010-09-28
190636 cnd executio gorrus RESO WONT Unstable tests due to "Channel is not opened" 2012-10-30
232294 cnd Code Mod gorrus RESO FIXE Untrusted "file exist" provider 2013-07-06
34850 java Unsuppor issues RESO INVA [java-mdr] Beans module automated test failed with many exceptions 2007-09-26
40436 ide Code issues RESO FIXE Commit validation test failure: IDEValidation.testDebugging: TimeoutExpiredException: Dialog with title "Finish Debugging Sessions" 2004-02-25
51191 editor Search issues RESO FIXE testFindInFile is failing randomly 2007-11-05
59331 java Unsuppor issues RESO FIXE NPE from ASTProvider in automated tests 2007-09-26
61453 qa Jellytoo issues RESO WORK Failures in testPerformMenu 2009-03-30
73086 xml XML Mult issues RESO FIXE Random test failure (Data Object Not Modified): testChangeModel in XmlMultiViewEditorTest 2009-10-08
73265 javaee EJB issues RESO WONT DDEditorTest random failures 2009-11-10
75379 xml XML Mult issues RESO FIXE xml/multiview test failures 2009-10-08
91186 ide Internal issues RESO FIXE Test failure - testServletExecution 2007-08-16
93648 editor Lexer issues RESO FIXE Failure in DataLoaderTests.DataObjectTest.Modify 2007-02-01
97271 ide Internal issues RESO DUPL Failing test: servlet execution 2007-08-16
106381 java Unsuppor issues RESO FIXE DataObjectManipulationTest - DONF at JavaSource.assignDocumentListener(JavaSource.java:1259) 2007-09-26
This result was limited to 500 bugs. See all search results for this query.
  Edit Search  
as
By use of this website, you agree to the NetBeans Policies and Terms of Use. © 2012, Oracle Corporation and/or its affiliates. Sponsored by Oracle logo