Issues Mailing List

Jan 80 Feb 104 Mar 82 Apr 104 May 103 Jun 125 Jul 177 Aug 270 Sep 198 Oct 72 Nov 39 Dec 19
Showing Page 1 of 2
Subject Author Date

12/11/01

[Bug 217956] UI Element / User-extensions are not configurable via Selenium Server Configuartion

marfous 11/01/2012

[Bug 217956] UI Element / User-extensions are not configurable via Selenium Server Configuartion

marfous 11/01/2012

[Bug 217956] UI Element / User-extensions are not configurable via Selenium Server Configuartion

zarry 11/01/2012

12/11/02

Paquetes a Egipto, Dubai e India

Viajes y Turismo 11/02/2012

12/11/03

[Bug 214947] Code coverage run in AWT

everflux 11/03/2012

[Bug 217920] NullPointerException at org.netbeans.api.project.ProjectUtils$BasicInformation.getDisplayName

robertjava 11/03/2012

12/11/05

[Bug 220390] org.openide.util.RequestProcessor$SlowItem: task failed due to: java.lang.NullPointerException

jkovalsky 11/05/2012

[Bug 171972] NullPointerException at org.netbeans.modules.showtodos.TodoSourceParsing.parseForAnnotatable

mps77 11/05/2012

12/11/06

5ти дневный курс: Техника бюджетирования

Развитие 11/06/2012

[Bug 218281] javax.swing.text.BadLocationException: org.netbeans.modules.showtodos.TodoSourceParsing.parse(TodoSourceParsing.java:73)

alied 11/06/2012

[Bug 218281] javax.swing.text.BadLocationException: org.netbeans.modules.showtodos.TodoSourceParsing.parse(TodoSourceParsing.java:73)

alied 11/06/2012

HELLO

Osvaldo Stark 11/06/2012

12/11/08

[Bug 212605] LowPerformance took 15773 ms.

cyhelsky 11/08/2012

[Bug 214366] org.netbeans.core.execution.ExitSecurityException: Exit from within user-loaded code

ovrabec 11/08/2012

[Bug 214366] org.netbeans.core.execution.ExitSecurityException: Exit from within user-loaded code

jglick 11/08/2012

Увольнение сотрудников

Увольнение без ошибок 11/08/2012

12/11/09

Re: Changelog as promised(updated)

Classmates . com 11/09/2012

You have been sent a file (Filename: Issues_N07.pdf)

TRULA Mcclain 11/09/2012

12/11/13

[Bug 213029] IllegalArgumentException: Width (0) and height (0) cannot be <= 0

ecerichter 11/13/2012

[Bug 213029] IllegalArgumentException: Width (0) and height (0) cannot be <= 0

ecerichter 11/13/2012

разошлем ваше коммерческое предложение по электронной почте

Огарёв 11/13/2012

12/11/14

[Bug 208292] Output Window should show output by failed tests

gtzabari 11/14/2012

[Bug 210614] CodeCompletion took 3466 ms.

kosmonaffft 11/14/2012

[Bug 222137] New: com.sun.tools.javac.jvm.ClassReader.fillIn: LowPerformance took 70554 ms.

exceptions_reporter 11/14/2012

[Bug 222137] com.sun.tools.javac.jvm.ClassReader.fillIn: LowPerformance took 70554 ms.

exceptions_reporter 11/14/2012

[Bug 212338] IllegalArgumentException: Parameter file was not normalized. Was null\bsf.jar instead of C:\Program Files (x86)\NetBeans Dev 201205070400\null\bsf.jar

widipa 11/14/2012

12/11/15

[Bug 222186] RuntimeException: C:\workspace\swisslife\development\eclipse_config\pmd.xml (No such file or directory)

mmirilovic 11/15/2012

12/11/17

[Bug 218276] NullPointerException at pmd.RunPMDAction.getDataObjects

ophers 11/17/2012

12/11/18

[Bug 222316] Competitive Scala Support

mmirilovic 11/18/2012

12/11/19

[Bug 212338] IllegalArgumentException: Parameter file was not normalized. Was null\bsf.jar instead of C:\Program Files (x86)\NetBeans Dev 201205070400\null\bsf.jar

roti 11/19/2012
Showing Page 1 of 2

Project Features

About this Project

Contrib was started in November 2009, is owned by Jiří Kovalský, and has 254 members.
By use of this website, you agree to the NetBeans Policies and Terms of Use (revision 20131025.e7cbc9d). © 2013, Oracle Corporation and/or its affiliates. Sponsored by Oracle logo
 
 
Close
loading
Please Confirm
Close