Thu Apr 17 2014 22:11:03 UTC
Hide Search Description
  • Resolution: ---
  • Component: Code
  • Product: ruby

62 bugs found.
ID Product Comp Assignee Status Resolution Summary Changed
193350 ruby Code issues NEW --- ide project view fails to show new file 2011-01-28
106873 ruby Code issues NEW --- Additional project templates for Ruby projects 2011-01-28
151085 ruby Code issues NEW --- IDE extendible and/or scriptable with Ruby 2011-01-28
164564 ruby Code issues NEW --- [67cat] [other] HAML support equal to RHTML or HTML.ERB support 2011-01-28
192171 ruby Code issues NEW --- download-selected-extbins fails because of o.jruby/external/jruby-src-1.1.4.zip 2011-01-28
195101 ruby Code emononen NEW --- NullPointerException at org.jrubyparser.parser.ParserSupport.getMatchNode 2011-02-07
199752 ruby Code emononen NEW --- NullPointerException at org.netbeans.modules.ruby.codecoverage.RubyCoverageProvider.wrapWithCoverage 2012-04-24
199856 ruby Code emononen NEW --- NullPointerException at org.netbeans.modules.ruby.codecoverage.RubyCoverageProvider.wrapWithCoverage 2011-07-02
200274 ruby Code emononen NEW --- Ruby Syntax highlighter fails to detect JSON notation when declaring hashes, through is a valid notation 2011-07-21
104379 ruby Code issues NEW --- Keystroke Shortcut for Generators Needed 2011-01-28
104815 ruby Code issues NEW --- HAML syntax highlighting 2010-12-06
109593 ruby Code issues NEW --- Mnemonic handling issue 2011-01-28
109742 ruby Code issues NEW --- Support for Regular Expression Extensions 2011-01-28
110499 ruby Code issues NEW --- enhancement: filter out lines from the stack trace 2011-01-28
110887 ruby Code issues NEW --- HAML support 2011-01-28
118464 ruby Code issues NEW --- add a complete project view to navigator 2011-01-28
118471 ruby Code issues NEW --- add a mode to navigator that pulls up editor code on selection 2011-01-28
118815 ruby Code issues NEW --- Implement block folding 2011-01-28
120085 ruby Code issues NEW --- open-file (alt-shift-O) should have an option to open files in gems 2011-01-28
120086 ruby Code issues NEW --- add 'open object containing method' dialog 2011-01-28
120088 ruby Code issues NEW --- Add ability to run external script with information about the code at the cursor location 2011-01-28
120622 ruby Code issues NEW --- Add UML style viewing and potentially code generation for ruby / rails classes 2011-01-28
130595 ruby Code issues NEW --- Documentation Analyzer Integration(dcov) 2011-01-28
130596 ruby Code issues NEW --- Profiler Intergration 2011-01-28
161533 ruby Code issues NEW --- Support for parallel programming tools 2011-01-28
162329 ruby Code issues NEW --- [67cat] [other] There needs to be a way to launch a JRuby application on Glassfish-V3-prelude directly under the profiler 2011-01-28
162330 ruby Code issues NEW --- [67cat] [other] There needs to be a way to launch a Ruby application using the Ruby Profiler within the IDE 2011-01-28
162331 ruby Code issues NEW --- [67cat] [other] There needs to be a way to launch a Ruby application using scripts other than "server" 2011-01-28
162351 ruby Code issues NEW --- [67cat] [tools] Gems dialog needs to default configuration to not fetch descriptions 2011-01-28
164744 ruby Code issues NEW --- [67cat] [other] Task Scanning for 2 projects takes excessive time 2011-01-28
169463 ruby Code issues NEW --- Link not clickable on the warning page 2009-08-03
171775 ruby Code issues NEW --- [68cat] [ruby][rake] Rake settings should be saved in project 2011-01-28
171776 ruby Code issues NEW --- [68cat] [ruby][gems] Superuser Password Handled Incorrectly during Gem Install 2011-03-08
173819 ruby Code issues NEW --- [68cat] [run] Run and debug no longer launch default browser 2011-01-28
174824 ruby Code issues NEW --- [68cat] [debugger] Unable to debug using Glassfish Gem 2011-01-28
175254 ruby Code issues NEW --- [68cat] [debugger] Add capability to find classes by Class id 2011-01-28
179756 ruby Code issues NEW --- support for haml and sass 2011-01-28
186460 ruby Code issues NEW --- NoClassDefFoundError: org/jrubyparser/ast/LiteralNode 2011-01-28
188113 ruby Code issues NEW --- UnsupportedOperationException: Not supported yet. 2011-01-28
188330 ruby Code issues NEW --- invalid multibyte escape error in 6.9 but not 6.8 2011-01-28
188412 ruby Code issues NEW --- debugger support for Ruby 1.9.1 is broken 2011-11-16
188558 ruby Code issues NEW --- Rspec Stack Trace 2011-01-28
188875 ruby Code issues NEW --- NullPointerException at org.netbeans.modules.ruby.elements.AstElement.create 2011-01-28
190201 ruby Code issues NEW --- javax.swing.text.BadLocationException: Invalid offset=9338 not within <0, 9322> 2011-01-28
190962 ruby Code issues NEW --- Ruby Mark Occurrences Behaviour Broken? 2011-01-28
192069 ruby Code issues NEW --- [70cat][generator] Database.yml file for JavaDB where database is not yet created is not generated properly. 2011-01-28
192084 ruby Code issues NEW --- [70cat][project] Creating new project for existing sources overwrites config/database.yml 2011-01-28
192275 ruby Code issues NEW --- Right clicking on project and selecting Test does not run Rails Test 2010-11-22
192725 ruby Code issues NEW --- 7.0 : newly created files are not visible in Ruby Project 2011-01-28
192790 ruby Code issues NEW --- java.io.IOException: No such file or directory 2012-12-21
193967 ruby Code issues NEW --- [70cat][ruby] Gem Platform is not selected for project when selected under Manage Platforms during project creation 2011-01-28
193968 ruby Code issues NEW --- [70cat][ruby] Project creation displays errors for rake task without indicating task executed 2011-01-28
193970 ruby Code issues NEW --- [70cat][ruby] Renaming project on CLI changes project name to ??? on copied project 2011-01-28
207025 ruby Code issues NEW --- ruby cannot be installed in net beans 7.1 2012-07-03
211169 ruby Code issues NEW --- org.rubyforge.debugcommons.RubyDebuggerException: Unable to read added breakpoint number in the specified timeout [15s] 2012-04-16
218588 ruby Code issues NEW --- Installation of Ruby Plugin doesn't work under Netbeans 7.2 2012-09-19
237791 ruby Code issues NEW --- NoSuchMethodError: org.jrubyparser.ast.RootNode.getBody()Lorg/jrubyparser/ast/Node; 2013-10-30
240130 ruby Code issues NEW --- AssertionError: bodyNode is not null 2014-01-28
174681 ruby Code issues NEW --- [68cat] [debugger] Some events don't appear to be fired properly after suspend 2011-01-28
191431 ruby Code issues NEW --- Incorrect highlighting of math operations 2011-01-28
186736 ruby Code emononen STAR --- Failed to build target: all-o.jruby.distro 2010-06-22
180840 ruby Code issues REOP --- Intermittent build failures in JRuby 2011-01-28
62 bugs found.
  Edit Search  
as

File a new bug in the "ruby" product

By use of this website, you agree to the NetBeans Policies and Terms of Use. © 2012, Oracle Corporation and/or its affiliates. Sponsored by Oracle logo