Fri Jul 3 2015 08:45:12 UTC
Hide Search Description
  • Resolution: ---
  • Component: TestNG
  • Product: java

15 bugs found.
ID Product Comp Assignee Status Resolution Summary Changed
208132 java TestNG jungi NEW --- Mixed mode 2012-02-07
208292 java TestNG jungi NEW --- Output Window should show output by failed tests 2012-11-14
213612 java TestNG theofanis NEW --- Running JUnit test in maven using testng does not execute test when CoS is on 2015-02-11
219939 java TestNG theofanis NEW --- TestNG functional testing support helper methods 2013-07-03
240025 java TestNG theofanis NEW --- [80cat] rename of package does not affect test 2014-01-10
247679 java TestNG theofanis NEW --- TestNG UI says no tests were executed but really were 2015-06-03
249036 java TestNG theofanis NEW --- ArrayIndexOutOfBoundsException: 7 2015-06-11
250191 java TestNG theofanis NEW --- NullPointerException at org.netbeans.modules.testng.api.TestNGUtils.createTests 2015-03-31
250446 java TestNG theofanis NEW --- NoSuchMethodError: java.util.Collection.iteratOr()Ljava/util/Iterator; 2015-02-16
250512 java TestNG theofanis NEW --- Ant Suite repeatedly show only one testng class names when running same class name on different test name 2015-06-11
251812 java TestNG theofanis NEW --- Under OS/X when a test fails with an exception during a Maven build the underlying process is not terminated 2015-04-29
252485 java TestNG theofanis NEW --- ArrayIndexOutOfBoundsException: 1 2015-05-19
253101 java TestNG theofanis NEW --- AssertionError: No suites running 2015-06-22
253293 java TestNG theofanis NEW --- ClassCastException: org.openide.nodes.ChildFactory$WaitFilterNode cannot be cast to org.netbeans.modules.gsf.testrunner.ui.api.TestMethodNode 18:46:37
154255 java TestNG jungi NEW --- Both of test methods with another paratameters run by re-running failed tests 2008-12-01
15 bugs found.
  Edit Search  

File a new bug in the "java" product

By use of this website, you agree to the NetBeans Policies and Terms of Use. © 2014, Oracle Corporation and/or its affiliates. Sponsored by Oracle logo