Fri May 27 2016 08:57:42 UTC
Hide Search Description
  • Product: cnd

25 bugs found.
ID Product Comp Assignee Status Resolution Summary Changed
155711 cnd -- Other alexey_vladykin VERI FIXE C/V test failed. testAreAttributesFine 2009-02-19
77948 cnd -- Other issues RESO WORK NPE in cnd.debugger.gdb.profiles.ui.ProfileNodeProvider 2007-09-06
173909 cnd -- Other akrasny RESO FIXE Run fails on Windows or Mac OS 2009-10-09
99777 cnd -- Other gordonp CLOS FIXE CND doesn't work if user installed cygwin on d:\ disk 2007-08-06
97646 cnd -- Other vv159170 CLOS FIXE Cann't install C/C++ Pack (20070312) correctly on Netbeans 5.5.1 2007-08-06
101897 cnd -- Other gordonp CLOS FIXE Need to update version of cnd modules 2007-11-26
77337 cnd -- Other gordonp RESO WORK cnd module loading failure 2007-09-06
221313 cnd -- Other alexvsimon RESO DUPL "New File" wizard doesn't work 2012-11-02
163225 cnd -- Other alexvsimon VERI FIXE NPE when user deletes project 2009-04-22
74541 cnd -- Other gordonp VERI FIXE Makefile indentation is wrong 2007-10-31
181587 cnd -- Other alexvsimon RESO FIXE There is no more file object in data object lookup 2010-03-08
101753 cnd -- Other vv159170 CLOS FIXE AssertionError in APTIncludeHandlerImpl.pushIncludeImpl() 2007-11-29
75930 cnd -- Other vkvashin RESO DUPL Deadlock when parsing current file simultaneously with background parsing 2007-09-06
98591 cnd -- Other vv159170 CLOS FIXE AssertionError: no object for UID KeyBasedUID on FileKey 2007-12-14
186512 cnd -- Other nnnnnk VERI FIXE "Run Again" and "Debug" doesn't work from Test Results tab 2010-05-28
221261 cnd -- Other akrasny VERI FIXE Failing tests in stable test distribution on Unix 2013-02-27
73170 cnd -- Other gordonp VERI FIXE stdouterr script not executable after installation 2007-12-20
208279 cnd -- Other issues RESO DUPL Find Occurences (Alt+F7) tries wrongly to modify the file 2012-02-13
190867 cnd -- Other vkvashin RESO FIXE IllegalArgumentException: Parameter file was not normalized. Was d:\projects_tests\clucene-0.9.10\test\search\..\util\english.h instead of D:\Projects_tests\clucene-0.9.10\test\util\English.h 2010-10-13
176068 cnd -- Other nnnnnk RESO FIXE Remove Parallel Adviser feature 2009-11-09
156805 cnd -- Other alexey_vladykin VERI FIXE C/V test failed. testAreAttributesFine 2009-02-19
98810 cnd -- Other issues RESO DUPL CND pack installer which is supposed to be used with nb5.5.1.rc1 does not find nb5.5.1 rc 2007-03-23
142438 cnd -- Other issues RESO FIXE Regression: cannot run makefile 2008-07-31
105444 cnd -- Other nzero2002 VERI FIXE error parser regression (EmptyStackException) 2007-11-29
111662 cnd -- Other thp CLOS FIXE exclude features Inspect Hierarchy, Inspect Includes and Find Usage from 5.5.1u1 2007-08-03
25 bugs found.
  Edit Search  
as

File a new bug in the "cnd" product

By use of this website, you agree to the NetBeans Policies and Terms of Use. © 2014, Oracle Corporation and/or its affiliates. Sponsored by Oracle logo