Fri Feb 12 2016 14:27:28 UTC
Hide Search Description
  • Product: cnd

25 bugs found.
ID Product Comp Assignee Status Resolution Summary Changed
257958 cnd Code Mod issues NEW --- Unnamed struct inside sizeof() and _Alignof() 10:00:26
257921 cnd Debugger henk89 NEW --- Breakpoint condition disappear when session ends Wed 10:31
257920 cnd Editor ilia NEW --- Support editing C/C++ License Headers from Options Wed 10:34
257919 cnd Code Mod ilia NEW --- Support refactoring of #ifndef guard block when changing header's file name. Wed 09:56
257915 cnd Code Mod petrk STAR --- Unresolved C11 _Atomic Thu 15:13
257908 cnd Code Com petrk RESO FIXE C pointer arithmetic doesn't work if there are no global "+" operators in a project Wed 02:31
257901 cnd Code Mod petrk RESO FIXE Failing org.netbeans.modules.cnd.modelimpl.trace.FileModel2Test Wed 02:32
257899 cnd -- Other issues NEW --- IDE can't jump from declaration to definition in complex case (1 declaration and 2 definitions) Tue 08:42
257895 cnd Project issues NEW --- IllegalArgumentException: Malformed \uxxxx encoding. Mon 17:02
257890 cnd Remote issues STAR --- The parsing hangs at some points for minutes at the same state. No code completion, no jumps to definitions, etc 14:15:00
257886 cnd Code Mod issues NEW --- AssertionError: virtual file path must be normalized StringRef{T:\Work\Sources\parking\trainer\qSqlDb.h} vs. FileData{Name=[string size=40+'0'] T:\Work\Sources\parking\trainer\QSqlDb.h, UniqueID=Uniqu Tue 12:21
257884 cnd Code Mod alexvsimon RESO FIXE LowPerformance took 43953 ms. 02:36:29
257881 cnd Project issues RESO INVA C++ Project uses wrong compiler gcc not g++ as expected Mon 04:29
257880 cnd Remote V issues RESO DUPL org.netbeans.modules.deadlock.detector.Detector$DeadlockDetectedException: MercurialRemote - ANY_KEY Mon 07:37
257866 cnd Code Mod petrk RESO DUPL Code model is not recovered after unrecognized macros Tue 12:41
257851 cnd Debugger henk89 NEW --- gdb shows wrong next line when stepping into in Quote sample on Ubuntu 2016-02-05
257850 cnd Debugger henk89 NEW --- File and line should be included when copying stack to clipboard 2016-02-04
257832 cnd -- Other issues NEW --- IDE doesn't recognize C++11 keywords in first standalone file 2016-02-03
257827 cnd -- Other issues NEW --- Auto insert function stubs not copying all const keywords 2016-02-03
257822 cnd Code Mod issues NEW --- Unresolved identifier in designated initializer of compound literal 2016-02-02
257821 cnd Code Mod issues NEW --- Unresolved identifier in designated initializer following sizeof a typedef 2016-02-02
257819 cnd Debugger henk89 NEW --- Navigation from call stack or debugging view to code is very inconvenient. 2016-02-02
257816 cnd Debugger henk89 NEW --- Debugging view should allow copying stack to clipboard 2016-02-02
257811 cnd Project vkvashin VERI FIXE Strange configuration text in project properties dialog Mon 09:22
257806 cnd Remote vkvashin VERI FIXE A11y test failed for newly added host connection settings Mon 09:26
25 bugs found.
  Edit Search  

File a new bug in the "cnd" product

By use of this website, you agree to the NetBeans Policies and Terms of Use. © 2014, Oracle Corporation and/or its affiliates. Sponsored by Oracle logo