Sun Jun 26 2016 01:21:41 UTC
Hide Search Description
  • Resolution: ---
  • Component: Compiler
  • Product: java

255 bugs found.
ID Product Comp Assignee Status Resolution Summary Changed
197604 java Compiler dbalek NEW --- Not able to compile project 2011-11-16
200970 java Compiler dbalek NEW --- AssertionError at com.sun.tools.javac.util.Assert.error 2016-05-31
256977 java Compiler dbalek NEW --- [regression] NB.Trunk reports a lot of false positives errors about correct JDK7/JKD8 code 2016-02-09
152191 java Compiler dbalek NEW --- Fix compile on save and compiler issues 2011-01-18
233230 java Compiler dbalek NEW --- AssertionError: No info for outermost class: Compare$Node 2016-06-17
237052 java Compiler dbalek NEW --- NullPointerException at com.sun.tools.javac.util.ListBuffer.append 2016-03-24
239657 java Compiler dbalek NEW --- AssertionError at com.sun.tools.javac.util.Assert.error 2016-02-11
92765 java Compiler dbalek NEW --- package declaration 2010-09-23
126320 java Compiler dbalek NEW --- Turn autocompile off 2010-11-29
134598 java Compiler dbalek NEW --- Build-in support for ODB 2008-05-06
163794 java Compiler dbalek NEW --- Ability to disable support for some primitive types 2010-02-17
177536 java Compiler dbalek NEW --- "Uncompilable source code - cannot find symbol" thrown unnecessarily from <clinit> 2009-11-27
177537 java Compiler dbalek NEW --- Throw LinkageError's, not RuntimeException's, for uncompilable source code 2013-10-04
179430 java Compiler dbalek NEW --- The error message box when compiling xml schemas is not needed. 2010-01-12
181884 java Compiler dbalek NEW --- Run/Build Project lead to different default encodings 2010-03-11
185775 java Compiler dbalek NEW --- ClassCastException: com.sun.tools.javac.code.Type$ClassType cannot be cast to com.sun.tools.javac.code.Type$MethodType 2015-03-12
186446 java Compiler dbalek NEW --- Clean and build produces compile-time errors 2010-05-20
188662 java Compiler dbalek NEW --- AssertionError: isSubtype 12 01:12:29
190141 java Compiler dbalek NEW --- Integrate Eclipse compiler 2010-09-03
194263 java Compiler dbalek NEW --- java.lang.NoClassDefFoundError thrown when start to debug project 2014-12-08
196747 java Compiler dbalek NEW --- Protection of the JAR Application on Java Desktop Application. 2011-03-15
205832 java Compiler dbalek NEW --- AE from Attr.attribClassBody 2015-09-23
215830 java Compiler dbalek NEW --- AssertionError: LetExpr is not part of a public API 2016-02-24
216886 java Compiler dbalek NEW --- AssertionError: class def not found: indexIn(edu.cmu.cs.stage3.alice.core.Element[]) in edu.cmu.cs.stage3.alice.core.Element flags: 2305843009213693954 original: null outermostMemberDef: null outermos 2016-05-26
222649 java Compiler dbalek NEW --- Main class was not added to manifest 2012-11-23
224611 java Compiler dbalek NEW --- ClassCastException: com.sun.tools.javac.jvm.ClassFile$NameAndType cannot be cast to com.sun.tools.javac.util.Name 2014-07-14
225011 java Compiler dbalek NEW --- AssertionError: isSubtype 20 2016-04-10
225024 java Compiler dbalek NEW --- NullPointerException at com.sun.tools.javac.comp.Check.localClassName 2015-11-14
225159 java Compiler dbalek NEW --- AssertionError at com.sun.tools.javac.jvm.Items$Item.load 2015-02-13
226443 java Compiler dbalek NEW --- Throwable at com.sun.tools.javac.util.DiagnosticSource.setEndPosTable 2015-08-20
229407 java Compiler dbalek NEW --- AssertionError: actual and formal argument lists differ in length 2014-03-25
231390 java Compiler dbalek NEW --- Don't stop output scrolling on "Sun proprietary API" warning 2013-06-17
233402 java Compiler dbalek NEW --- AssertionError at com.sun.tools.javac.util.Assert.error 2013-12-25
235109 java Compiler dbalek NEW --- AssertionError at com.sun.tools.javac.util.Assert.error 2016-02-01
235218 java Compiler dbalek NEW --- NullPointerException at com.sun.tools.javac.comp.MemberEnter$Synthesizer.visit 2015-10-21
235871 java Compiler dbalek NEW --- ClassCastException: com.sun.tools.javac.code.Attribute$Error cannot be cast to com.sun.tools.javac.code.Attribute$Class 2015-05-15
236073 java Compiler dbalek NEW --- IllegalArgumentException: org.llvm.adt.DenseMap.iterator 2015-05-18
236155 java Compiler dbalek NEW --- NullPointerException at com.sun.tools.javac.comp.Resolve.checkMethod 2015-04-09
236297 java Compiler dbalek NEW --- nb.javac should have version available 2013-10-16
236343 java Compiler dbalek NEW --- AssertionError at com.sun.tools.javac.util.Assert.error 2016-04-10
236368 java Compiler dbalek NEW --- AssertionError: unexpected type: <nulltype> 2015-03-24
236522 java Compiler dbalek NEW --- NullPointerException at com.sun.tools.javac.comp.Attr.visitTry 2016-03-18
236619 java Compiler dbalek NEW --- File Reliably crashes Netbeans parser 2013-10-18
236685 java Compiler dbalek NEW --- IndexOutOfBoundsException: end < start (21212 < 21237) 2014-05-05
236701 java Compiler dbalek NEW --- AssertionError at com.sun.tools.javac.comp.Lower.classOfType 2016-03-10
236927 java Compiler dbalek NEW --- Assert errors in ide logs 2013-10-10
237036 java Compiler dbalek NEW --- AssertionError: Inconsistent param types/names. Signature: [addAttributeToModel(PresentationModel, org.opendolphin.core.client.ClientAttribute)], Names: [addAttributeToModel(PresentationModel presenta 2013-10-11
237081 java Compiler dbalek NEW --- NullPointerException at com.sun.tools.javac.comp.TransTypes.visitMethodDef 2014-09-22
237121 java Compiler dbalek NEW --- NullPointerException at com.sun.tools.javac.jvm.Code.typecode 2013-10-15
237788 java Compiler dbalek NEW --- org.netbeans.modules.java.hints.onsave.RemoveUnusedAfterSave.runLocked: LowPerformance took 24518 ms. 2014-03-11
237945 java Compiler dbalek NEW --- AssertionError at com.sun.tools.javac.util.Assert.error 2013-11-04
238405 java Compiler dbalek NEW --- IllegalArgumentException: int 2013-11-15
238654 java Compiler dbalek NEW --- NullPointerException at com.sun.tools.javac.comp.Check.checkConflicts 2014-03-24
238655 java Compiler dbalek NEW --- NullPointerException at com.sun.tools.javac.model.JavacElements.addMembers 2014-05-07
238696 java Compiler dbalek NEW --- OutOfMemoryError: Java heap space 2014-12-26
238735 java Compiler dbalek NEW --- NullPointerException at com.sun.tools.javac.comp.MemberEnter.complete 2014-11-28
238802 java Compiler dbalek NEW --- NullPointerException at com.sun.tools.javac.code.Types$DescriptorCache.findDescriptorInternal 2014-08-12
238833 java Compiler dbalek NEW --- StackOverflowError at com.sun.tools.javac.util.Log.shouldReport 2013-11-26
239261 java Compiler dbalek NEW --- NullPointerException at com.sun.tools.javac.code.Types.isConvertible 2015-09-10
239379 java Compiler dbalek NEW --- Duplicate class warning after moving sources into correct package structure 2013-12-11
239393 java Compiler dbalek NEW --- ((ClassTree) path.getLeaf()).getModifiers().getFlags() always returns ["public", "static] for nested classes/interfaces within interfaces 2013-12-12
239410 java Compiler dbalek NEW --- NullPointerException at com.sun.tools.javac.comp.Attr.checkForDeclarationAnnotations 2013-12-12
239826 java Compiler dbalek NEW --- Autocomplete failed whilst adding setTooltip text 2014-01-03
239866 java Compiler dbalek NEW --- OutOfMemoryError: GC overhead limit exceeded 2013-12-30
239928 java Compiler dbalek NEW --- AssertionError while editing 2014-01-06
240558 java Compiler dbalek NEW --- IllegalArgumentException: (java.lang.String)void 2016-03-07
240566 java Compiler dbalek NEW --- NullPointerException at com.sun.tools.javac.code.Types.glb 2014-01-16
240815 java Compiler dbalek NEW --- NullPointerException at com.sun.tools.javac.code.Types$20.visitArrayType 2014-01-22
240822 java Compiler dbalek NEW --- NullPointerException at com.sun.tools.javac.comp.Resolve.findMethod 2015-10-07
240846 java Compiler dbalek NEW --- UnsupportedOperationException: FastJar not supported for relocated root of archive C:\Program Files\Java\jdk1.7.0_21\lib\ct.sym, relocation META-INF/sym/rt.jar/ 2014-01-22
240999 java Compiler dbalek NEW --- IllegalArgumentException: /home/sdl/projects/pure4/git/base-uh/admin/src/main/java/dk@c09ce0a8:6de09db2 (valid: true) not in /home/sdl/projects/pure4/git/base-uh/admin/src/main/java@b112f30c:6c86b2b0 2014-07-22
241178 java Compiler dbalek NEW --- CodeCompletion took 2408 ms. 2014-02-10
241275 java Compiler dbalek NEW --- Editor ignores @SuppressWarnings("deprecation") 2014-12-17
241566 java Compiler dbalek NEW --- OutOfMemoryError: GC overhead limit exceeded 2014-02-08
241715 java Compiler dbalek NEW --- NullPointerException at com.sun.tools.javac.comp.Attr.visitNewClass 2015-04-19
241930 java Compiler dbalek NEW --- AssertionError: io.undertow.server.protocol.http.HttpRequestParser$$generated: completer = com.sun.tools.javac.jvm.ClassReader$1@39aea2da; class file = file:/home/mkatakai/.cache/netbeans/dev/index/s3 2014-02-16
242104 java Compiler dbalek NEW --- AssertionError at com.sun.tools.javac.util.Assert.error 2016-05-08
242154 java Compiler dbalek NEW --- IDE dies (hangs) after completion error 2014-08-08
242299 java Compiler dbalek NEW --- NullPointerException at com.sun.tools.javac.main.JavaCompiler.unrecoverableError 2015-08-24
242393 java Compiler dbalek NEW --- AssertionError at com.sun.tools.javac.util.Assert.error 2015-08-11
242864 java Compiler dbalek NEW --- AssertionError: Value of x -1 17:57:28
242882 java Compiler dbalek NEW --- NullPointerException at com.sun.tools.javac.comp.Attr.visitNewClass 2014-03-13
242968 java Compiler dbalek NEW --- target/generated-sources/groovy-stubs shown with bogus errors 2014-03-21
243062 java Compiler dbalek NEW --- OutOfMemoryError: GC overhead limit exceeded 2014-03-28
243197 java Compiler dbalek NEW --- NullPointerException at com.sun.tools.javac.model.JavacElements.addMembers 2014-03-28
243223 java Compiler dbalek NEW --- StackOverflowError at com.sun.tools.javac.code.Types$SameTypeVisitor.visitClassType 2014-05-21
243693 java Compiler dbalek NEW --- AssertionError at com.sun.tools.javac.util.Assert.error 2014-04-09
244188 java Compiler dbalek NEW --- Can't set a breakpoint inside a lambda 2014-04-30
244415 java Compiler dbalek NEW --- ClassCastException: com.sun.tools.javac.code.Symbol$ClassSymbol cannot be cast to com.sun.tools.javac.util.Name 2014-05-10
244592 java Compiler dbalek NEW --- NullPointerException at com.sun.tools.javac.code.Symbol.isInheritedIn 2014-08-05
244789 java Compiler dbalek NEW --- NullPointerException at com.sun.tools.javac.comp.Attr.visitBinary 2014-05-29
244926 java Compiler dbalek NEW --- NullPointerException at com.sun.tools.javac.code.Types$DefaultTypeVisitor.visit 2014-06-06
244936 java Compiler dbalek NEW --- NullPointerException at com.sun.tools.javac.comp.Attr$TypeAnnotationsValidator.visitNewClass 2014-06-07
245369 java Compiler dbalek NEW --- OutOfMemoryError: Java heap space 2014-07-03
245790 java Compiler dbalek NEW --- IllegalStateException at org.netbeans.modules.java.source.parsing.WriteBackTransaction.createFileObject 2015-11-21
245928 java Compiler dbalek NEW --- Annotation processor fails with CAL10N 2014-07-23
246150 java Compiler dbalek NEW --- NullPointerException at com.sun.tools.javac.code.Types.isSignaturePolymorphic 2014-07-30
246352 java Compiler dbalek NEW --- AssertionError at com.sun.tools.javac.util.Assert.error 2014-08-08
246425 java Compiler dbalek NEW --- NullPointerException at com.sun.tools.javac.comp.Lower.accessClass 2015-03-26
246468 java Compiler dbalek NEW --- AssertionError: Inconsistent param types/names. Signature: [equals-java.lang.Object-], Names: [equals(Object obj)] 2014-08-15
246512 java Compiler dbalek NEW --- AssertionError: the result of hiddenInInternal() can't be null 2016-02-12
246564 java Compiler dbalek NEW --- NB8 IDE freeze for a while editing JSP with a lot of includes 2014-09-08
246834 java Compiler dbalek NEW --- NullPointerException at com.sun.tools.javac.util.Log$DeferredDiagnosticHandler.report 2015-04-30
247283 java Compiler dbalek NEW --- Annotation: An error occurred during parsing of java/util/Map.java 2014-09-19
247421 java Compiler dbalek NEW --- ClassCastException Type$ErrorType vs. Type$ArrayType 2014-11-14
247530 java Compiler dbalek NEW --- Refactoring failure 2014-09-29
247781 java Compiler dbalek NEW --- UnsupportedOperationException at java.util.AbstractCollection.add 2014-11-03
247789 java Compiler dbalek NEW --- Compiler failure - ClassCastException 2014-10-08
247814 java Compiler dbalek NEW --- AssertionError: <anonymous > 2014-10-10
247952 java Compiler dbalek NEW --- ArrayIndexOutOfBoundsException: -1 2015-02-14
248089 java Compiler dbalek NEW --- NullPointerException at com.sun.tools.javac.comp.Check.annotationApplicable 2014-10-22
248162 java Compiler dbalek NEW --- Applying "redundant type arguments in new expression (use diamond operator instead)" hint leads to compiler error 2015-03-24
248247 java Compiler dbalek NEW --- java.lang.NullPointerException at com.sun.tools.javac.comp.Attr.attribTree, NetBeans hangs when saving file 2014-10-29
248441 java Compiler dbalek NEW --- It has been announced as bug before but it continues to happen with 8.0.1 version . when u delete directories or even classes from the project they return to your war file or build directory propably from cache. 2015-07-07
248963 java Compiler dbalek NEW --- Exception while moving method 2015-11-23
249225 java Compiler dbalek NEW --- ClassCastException: com.sun.tools.javac.code.Type$JCVoidType cannot be cast to com.sun.tools.javac.code.Type$ClassType 2015-01-12
249345 java Compiler dbalek NEW --- AssertionError: isSubClass Q 2016-05-06
249349 java Compiler dbalek NEW --- AssertionError at com.sun.tools.javac.code.Symbol.clone 2014-12-14
249363 java Compiler dbalek NEW --- NullPointerException at com.sun.tools.javac.comp.Attr.visitVarDef 2014-12-15
250430 java Compiler dbalek NEW --- NetBeans should properly support cross-compiling 2015-02-15
250595 java Compiler dbalek NEW --- AssertionError: isSameType UNKNOWN 2016-05-18
250843 java Compiler dbalek NEW --- com.sun.tools.javac.util.FatalError: Fatal Error: Unable to find method values 2015-05-08
250919 java Compiler dbalek NEW --- NullPointerException at com.sun.tools.javac.main.JavaCompiler.unrecoverableError 2015-03-05
250970 java Compiler dbalek NEW --- Severe error during refactoring 2015-03-16
251196 java Compiler dbalek NEW --- null pointer exception 2015-03-17
251357 java Compiler dbalek NEW --- NullPointerException at com.sun.tools.javac.code.Type.map 2015-03-23
251661 java Compiler dbalek NEW --- OutOfMemoryError: GC overhead limit exceeded 2015-05-21
251740 java Compiler dbalek NEW --- AssertionError: unexpected type: none 2015-04-12
251840 java Compiler dbalek NEW --- NullPointerException at com.sun.tools.javac.comp.Resolve.rawInstantiate 2015-04-15
252129 java Compiler dbalek NEW --- IllegalArgumentException: Incorrect number of type arguments 2016-04-19
252190 java Compiler dbalek NEW --- NullPointerException at com.sun.tools.javac.comp.Attr$TypeAnnotationsValidator.visitNewClass 2015-05-01
252203 java Compiler dbalek NEW --- NullPointerException at org.netbeans.modules.java.source.PostFlowAnalysis.visitMethodDef 2016-04-10
252223 java Compiler dbalek NEW --- Project running problems depending on path of project 2015-05-19
252285 java Compiler dbalek NEW --- OutOfMemoryError at java.io.FileInputStream.readBytes 2015-05-07
252312 java Compiler dbalek NEW --- NullPointerException at com.sun.tools.javac.comp.Check.checkNonCyclicElements 2015-10-09
252336 java Compiler dbalek NEW --- NullPointerException at com.sun.tools.javac.jvm.Code.emitop1w 2015-10-22
252344 java Compiler dbalek NEW --- Throwable at com.sun.tools.javac.util.DiagnosticSource.setEndPosTable 2015-05-11
252403 java Compiler dbalek NEW --- ClassCastException: com.sun.tools.javac.code.Attribute$UnresolvedClass cannot be cast to com.sun.tools.javac.code.Attribute$Class 2015-07-28
252410 java Compiler dbalek NEW --- NullPointerException at com.sun.tools.javac.main.JavaCompiler.unrecoverableError 2015-05-15
252424 java Compiler dbalek NEW --- NullPointerException at com.sun.tools.javac.comp.Attr$TypeAnnotationsValidator.validateAnnotatedType 2015-12-16
252549 java Compiler dbalek NEW --- Error parsing file doesn't go away after fixing errors 2015-05-22
252616 java Compiler dbalek NEW --- AssertionError at com.sun.tools.javac.util.Assert.error 2015-09-18
252649 java Compiler dbalek NEW --- ArrayIndexOutOfBoundsException: 1277 2015-06-03
252722 java Compiler dbalek NEW --- AssertionError at com.sun.tools.javac.util.Assert.error 2015-06-15
252724 java Compiler dbalek NEW --- ClassCastException: com.sun.tools.javac.tree.JCTree$JCMethodDecl cannot be cast to com.sun.source.tree.StatementTree 2015-08-31
252729 java Compiler dbalek NEW --- The type of X is erroneous 2015-12-07
252744 java Compiler dbalek NEW --- AssertionError: Wrong diagnostic handler: com.sun.tools.javac.util.Log$DiscardDiagnosticHandler@26a11173 Thread dump: Debugger operator thread java.lang.Object.wait(Native Method) java.lang.Object.w 2015-06-29
252776 java Compiler dbalek NEW --- NullPointerException at com.sun.tools.javac.processing.JavacProcessingEnvironment$1.visitTopLevel 2016-05-14
252916 java Compiler dbalek NEW --- StackOverflowError at com.sun.tools.javac.code.Type.accept 2015-10-13
252918 java Compiler dbalek NEW --- StackOverflowError at com.sun.tools.javac.code.Type$ClassType.isParameterized 2015-08-07
252948 java Compiler dbalek NEW --- Convert to lambda is provided for project with source format < 1.8 2015-07-29
253053 java Compiler dbalek NEW --- AssertionError: Null members closure returned for symbol: java.lang.Thread.UncaughtExceptionHandler of type: java.lang.Thread.UncaughtExceptionHandler 2016-04-27
253289 java Compiler dbalek NEW --- OutOfMemoryError: GC overhead limit exceeded 2015-07-03
253396 java Compiler dbalek NEW --- AssertionError at com.sun.tools.javac.util.Assert.error 2015-09-15
253596 java Compiler dbalek NEW --- NullPointerException at com.sun.tools.javac.code.Types$Subst.visitTypeVar 2015-10-15
253608 java Compiler dbalek NEW --- NullPointerException at com.sun.tools.javac.comp.Analyzer$LambdaAnalyzer.match Fri 17:57
253895 java Compiler dbalek NEW --- AssertionError at com.sun.tools.javac.util.Assert.error 2015-07-28
254202 java Compiler dbalek NEW --- IllegalArgumentException: edu.harvard.iq.dataverse.authorization.groups.impl.ipaddress.ip.IpAddressRange&java.io.Serializable 2015-11-30
254479 java Compiler dbalek NEW --- NullPointerException at com.sun.tools.javac.comp.Resolve$AbstractMethodCheck.argumentsAcceptable 2015-10-07
254551 java Compiler dbalek NEW --- AssertionError: Unexpected tree: (activity activity)->(ERROR) with kind: LAMBDA_EXPRESSION within: (activity activity)->(ERROR) with kind: LAMBDA_EXPRESSION 2016-02-22
254602 java Compiler dbalek NEW --- NullPointerException at com.sun.tools.javac.comp.Resolve.resolveInternalMethod 2015-10-19
254938 java Compiler dbalek NEW --- AssertionError at com.sun.tools.javac.util.Assert.error 2015-09-02
255392 java Compiler dbalek NEW --- NullPointerException at com.sun.tools.javac.code.Types.isSubtype 2016-05-05
255488 java Compiler dbalek NEW --- NullPointerException at com.sun.tools.javac.code.Types$DescriptorFilter.accepts 2015-09-22
255489 java Compiler dbalek NEW --- NullPointerException: Issue #246934 - method tree: protected z16$z1 m1(z102 var1) { byte[] var2 = new byte[64]; int var3 = 0; z16$z1 var4 = new z16$z1(this); try { var3 = var1 2015-09-24
256037 java Compiler dbalek NEW --- [81cat] NullPointerException at com.sun.tools.javac.comp.Attr.visitTypeParameter 2015-10-20
256070 java Compiler dbalek NEW --- NullPointerException at com.sun.tools.javac.jvm.Code.emitop1w 2015-10-21
256072 java Compiler dbalek NEW --- OutOfMemoryError: GC overhead limit exceeded 2015-10-21
256227 java Compiler dbalek NEW --- com.sun.tools.javac.jvm.ClassReader.fillIn: LowPerformance took 37811 ms. 2016-02-17
256275 java Compiler dbalek NEW --- IllegalArgumentException: Not supported: org.netbeans.modules.java.debugjavac.impl.Utilities$1[mem://mem] 2015-10-30
256349 java Compiler dbalek NEW --- Netbeans compiles lambda incorrectly (vs. javac) 2016-01-18
256780 java Compiler dbalek NEW --- NullPointerException at com.sun.source.util.TreePath.<init> 2016-01-16
256788 java Compiler dbalek NEW --- IllegalArgumentException: AjaxSMCheckBox(java.lang.String,org.apache.wicket.model.IModel<java.lang.Boolean>,org.apache.wicket.model.IModel<?>)@<anonymous org.apache.wicket.markup.html.list.ListView<eu 2016-01-31
256879 java Compiler dbalek NEW --- AssertionError: hudson.model.Job<P,R> 2015-11-30
256908 java Compiler dbalek NEW --- ArrayIndexOutOfBoundsException: -2 2015-12-01
256941 java Compiler dbalek NEW --- ClassCastException: com.sun.tools.javac.tree.JCTree$JCTypeApply cannot be cast to com.sun.tools.javac.tree.JCTree$JCIdent 2016-02-13
256966 java Compiler dbalek NEW --- NullPointerException at com.sun.tools.javac.comp.Check.checkImportedPackagesObservable 2016-05-02
257041 java Compiler dbalek NEW --- IndexOutOfBoundsException: Index: 0, Size: 0 2015-12-08
257060 java Compiler dbalek NEW --- AssertionError: <error> Mon 09:27
257065 java Compiler dbalek NEW --- OutOfMemoryError: GC overhead limit exceeded 2015-12-09
257079 java Compiler dbalek NEW --- NullPointerException at com.sun.tools.javac.comp.Attr$ResultInfo.attr 2015-12-09
257178 java Compiler dbalek NEW --- AssertionError at com.sun.tools.javac.util.Assert.error Fri 18:51
257184 java Compiler dbalek NEW --- AssertionError at com.sun.tools.javac.util.Assert.error 2015-12-16
257194 java Compiler dbalek NEW --- AssertionError: Wrong diagnostic handler: com.sun.tools.javac.util.Log$DeferredDiagnosticHandler@814812b Thread dump: Thread-10 java.lang.Object.wait(Native Method) java.lang.Object.wait(Object.java 2015-12-17
257198 java Compiler dbalek NEW --- NullPointerException at com.sun.tools.javac.jvm.ClassReader.enterTypevars 2015-12-18
257235 java Compiler dbalek NEW --- OutOfMemoryError: GC overhead limit exceeded 2015-12-21
257244 java Compiler dbalek NEW --- NullPointerException at com.sun.tools.javac.code.Types$DefaultTypeVisitor.visit 2016-02-26
257282 java Compiler dbalek NEW --- AssertionError at com.sun.tools.javac.util.Assert.error Mon 09:33
257298 java Compiler dbalek NEW --- AssertionError: Wrong diagnostic handler: com.sun.tools.javac.util.Log$DeferredDiagnosticHandler@2d663063 Thread dump: Inactive RequestProcessor thread [Was:Flush UI Logs/org.netbeans.modules.uihandle 2015-12-26
257480 java Compiler dbalek NEW --- NullPointerException at com.sun.source.util.TreePath.<init> 2016-01-08
257487 java Compiler dbalek NEW --- NullPointerException at com.sun.tools.javac.comp.Lower.visitApply 2016-01-08
257533 java Compiler dbalek NEW --- AssertionError at com.sun.tools.javac.util.Assert.error 2016-06-03
257592 java Compiler dbalek NEW --- AssertionError: Unexpected tree: Map.<String, String><error>() with kind: METHOD_INVOCATION within: Map.<String, String><error>() with kind: METHOD_INVOCATION 2016-01-15
257600 java Compiler dbalek NEW --- AssertionError at com.sun.tools.javac.util.Assert.error 2016-01-16
257649 java Compiler dbalek NEW --- NullPointerException at com.sun.tools.javac.code.Types$SameTypeVisitor.visitClassType 2016-05-27
257739 java Compiler dbalek NEW --- NullPointerException at com.sun.tools.javac.main.JavaCompiler.attribute 2016-01-28
257758 java Compiler dbalek NEW --- AssertionError at com.sun.tools.javac.util.Assert.error 2016-05-24
257772 java Compiler dbalek NEW --- AssertionError at com.sun.tools.javac.util.Assert.error Thu 09:09
257782 java Compiler dbalek NEW --- ClassCastException: com.sun.tools.javac.tree.JCTree$JCVariableDecl cannot be cast to com.sun.tools.javac.tree.JCTree$JCMethodDecl 2016-03-01
257786 java Compiler dbalek NEW --- com.sun.tools.javac.comp.Infer$InferenceException at com.sun.tools.javac.comp.Infer.<init> 2016-01-31
257855 java Compiler dbalek NEW --- Unnecessary compiler warning when lambda parameter is not used 2016-02-04
257955 java Compiler dbalek NEW --- OutOfMemoryError: Java heap space 2016-02-12
257967 java Compiler dbalek NEW --- ClassCastException: com.sun.tools.javac.code.Type$UnionClassType cannot be cast to com.sun.tools.javac.code.Type$IntersectionClassType 2016-02-12
258013 java Compiler dbalek NEW --- NullPointerException at com.sun.tools.javac.comp.Resolve.resolveIdent 2016-02-16
258038 java Compiler dbalek NEW --- IllegalArgumentException: java.lang.Number&java.lang.Comparable<?> 2016-02-17
258125 java Compiler dbalek NEW --- AssertionError: java.lang.NullPointerException 2016-02-24
258153 java Compiler dbalek NEW --- OutOfMemoryError: GC overhead limit exceeded 2016-02-26
258156 java Compiler dbalek NEW --- NullPointerException at com.sun.tools.javac.comp.Resolve.findVar 2016-02-26
258195 java Compiler dbalek NEW --- Possible javac changes break error fixes 2016-03-01
258205 java Compiler dbalek NEW --- Compiler throws NPEs and Assertions on malformed annotations 2016-03-01
258249 java Compiler dbalek NEW --- NullPointerException at com.sun.tools.javac.code.Symtab.lookupPackage 2016-03-04
258282 java Compiler dbalek NEW --- StackOverflowError at java.io.UnixFileSystem.list 2016-03-14
258301 java Compiler dbalek NEW --- NullPointerException at com.sun.tools.javac.comp.Analyzer$LambdaAnalyzer.match 2016-03-10
258554 java Compiler dbalek NEW --- NullPointerException at com.sun.tools.javac.comp.Lower.visitBinary 2016-05-24
258617 java Compiler dbalek NEW --- NullPointerException at com.sun.tools.javac.jvm.Code.typecode 2016-04-01
258749 java Compiler dbalek NEW --- NullPointerException at com.sun.tools.javac.comp.Resolve.findType 2016-04-09
258759 java Compiler dbalek NEW --- AssertionError at com.sun.tools.javac.util.Assert.error 2016-04-10
258762 java Compiler dbalek NEW --- JDK_9 com.sun.tools.javac.code.Symbol$CompletionFailure: cannot resolve modules 2016-05-23
258778 java Compiler dbalek NEW --- AssertionError at com.sun.tools.javac.util.Assert.error 2016-05-26
258800 java Compiler dbalek NEW --- AssertionError at com.sun.tools.javac.util.Assert.error 2016-05-18
258803 java Compiler dbalek NEW --- AssertionError at com.sun.tools.javac.comp.Lower.classOfType 2016-05-09
258833 java Compiler dbalek NEW --- NullPointerException at com.sun.tools.javac.comp.TypeEnter$AbstractHeaderPhase$Synthesizer.visit 2016-05-17
258851 java Compiler dbalek NEW --- NullPointerException at com.sun.tools.javac.jvm.Gen.getAndRemoveNonFieldTAs 2016-04-15
258897 java Compiler dbalek NEW --- AssertionError: R.getDTOType 2016-04-19
258927 java Compiler dbalek NEW --- [Java8] Invalid type inference in 2016-04-20
258943 java Compiler dbalek NEW --- AssertionError: Visiting tree node before memberEnter 2016-04-21
258953 java Compiler dbalek NEW --- NullPointerException at com.sun.tools.javac.comp.Annotate.attributeAnnotationType 2016-05-09
258976 java Compiler dbalek NEW --- NullPointerException at com.sun.tools.javac.comp.Resolve.findMethod 2016-04-22
259046 java Compiler dbalek NEW --- AssertionError: Unresolved frame: (ERROR) of kind: ERRONEOUS Looking for tree: @FXML() <error> 2016-04-28
259142 java Compiler dbalek NEW --- org.openide.util.RequestProcessor$SlowItem: task failed due to: java.lang.NullPointerException 2016-05-17
259145 java Compiler dbalek NEW --- Add warning for cyclic dependencies between classes. 2016-05-06
261018 java Compiler dbalek NEW --- org.netbeans.modules.java.source.parsing.FileObjects$InvalidFileException: Arquivo inv 2016-05-10
262183 java Compiler dbalek NEW --- AssertionError at com.sun.tools.javac.util.Assert.error 2016-06-03
262234 java Compiler dbalek NEW --- NullPointerException at com.sun.tools.javac.code.Types$DescriptorFilter.accepts 2016-05-26
262263 java Compiler dbalek NEW --- AssertionError at com.sun.tools.javac.util.Assert.error 2016-06-12
262347 java Compiler dbalek NEW --- AssertionError at com.sun.tools.javac.util.Assert.error 2016-06-06
262409 java Compiler dbalek NEW --- IndexOutOfBoundsException: Index: 0, Size: 0 2016-06-13
262479 java Compiler dbalek NEW --- NullPointerException at com.sun.tools.javac.model.JavacTypes.asMemberOf 2016-06-19
262495 java Compiler dbalek NEW --- AssertionError: Wrong diagnostic handler: com.sun.tools.javac.util.Log$DiscardDiagnosticHandler@5902ace8 Thread dump: Inactive RequestProcessor thread [Was:EditorBracesMatching/org.netbeans.modules.ed Mon 22:03
262496 java Compiler dbalek NEW --- AssertionError at com.sun.tools.javac.comp.Enter.shadowTypeEnvs Mon 22:12
262511 java Compiler dbalek NEW --- com.sun.tools.javac.jvm.ClassReader.fillIn: LowPerformance took 195416 ms. Tue 10:07
262512 java Compiler dbalek NEW --- AssertionError: isSubtype METHOD Tue 10:12
262575 java Compiler dbalek NEW --- Internal compiler complains about a non-existent error 17:52:47
124864 java Compiler dbalek NEW --- Problems with nested generics 2009-10-30
139183 java Compiler dbalek NEW --- Reference tree for compiler dependencies 2008-07-07
205428 java Compiler dbalek NEW --- CancelAbort stack trace printed to log 2014-07-03
211438 java Compiler dbalek NEW --- Endless ClassFormatError exceptions in log 2013-09-13
202755 java Compiler dbalek STAR --- [71cat] AssertionError at com.sun.tools.javac.util.Assert.error 2016-06-08
239183 java Compiler dbalek STAR --- com.sun.tools.javac.comp.Resolve$InapplicableMethodException at com.sun.tools.javac.comp.Resolve.<init> 2016-06-06
161560 java Compiler dbalek REOP --- NullPointerException at com.sun.tools.javac.comp.Resolve.findVar 2016-02-29
233830 java Compiler dbalek REOP --- Exception during the build 2014-02-10
255555 java Compiler dbalek REOP --- Build fails, cache problem? 2015-10-01
258105 java Compiler dbalek REOP --- Refactoring error when moving a class 2016-02-23
233098 java Compiler jlahoda REOP --- The following options were not recognized by any processor: '[eclipselink.canonicalmodel.use_static_factory]' 2016-05-03
190200 java Compiler dbalek REOP --- Netbean Library Source Code Compile Error 2014-04-01
255 bugs found.
  Edit Search  
as

File a new bug in the "java" product

By use of this website, you agree to the NetBeans Policies and Terms of Use. © 2014, Oracle Corporation and/or its affiliates. Sponsored by Oracle logo