Sat Aug 29 2015 07:32:23 UTC
Hide Search Description
  • Resolution: ---
  • Component: Compiler
  • Product: java

218 bugs found.
ID Product Comp Assignee Status Resolution Summary Changed
134598 java Compiler dbalek NEW --- Build-in support for ODB 2008-05-06
139183 java Compiler dbalek NEW --- Reference tree for compiler dependencies 2008-07-07
124864 java Compiler dbalek NEW --- Problems with nested generics 2009-10-30
177536 java Compiler dbalek NEW --- "Uncompilable source code - cannot find symbol" thrown unnecessarily from <clinit> 2009-11-27
179430 java Compiler dbalek NEW --- The error message box when compiling xml schemas is not needed. 2010-01-12
163794 java Compiler dbalek NEW --- Ability to disable support for some primitive types 2010-02-17
181884 java Compiler dbalek NEW --- Run/Build Project lead to different default encodings 2010-03-11
186446 java Compiler dbalek NEW --- Clean and build produces compile-time errors 2010-05-20
190141 java Compiler dbalek NEW --- Integrate Eclipse compiler 2010-09-03
92765 java Compiler dbalek NEW --- package declaration 2010-09-23
126320 java Compiler dbalek NEW --- Turn autocompile off 2010-11-29
152191 java Compiler dbalek NEW --- Fix compile on save and compiler issues 2011-01-18
196747 java Compiler dbalek NEW --- Protection of the JAR Application on Java Desktop Application. 2011-03-15
197604 java Compiler dbalek NEW --- Not able to compile project 2011-11-16
206076 java Compiler tzezula NEW --- Outer class is not visible in scope of inner class 2011-12-07
210393 java Compiler dbalek NEW --- Netbeans runs it's own cache, not just compiled sources 2012-04-04
214649 java Compiler dbalek NEW --- NullPointerException at com.sun.tools.javac.comp.Attr.visitNewClass 2012-06-22
188662 java Compiler dbalek NEW --- AssertionError: isSubtype 12 2012-07-11
216408 java Compiler dbalek NEW --- Compile on save and F6 2012-08-09
222649 java Compiler dbalek NEW --- Main class was not added to manifest 2012-11-23
178289 java Compiler dbalek NEW --- [68cat] Uncompilable code on CoS 2012-11-28
205832 java Compiler dbalek NEW --- AE from Attr.attribClassBody 2012-12-20
224917 java Compiler dbalek NEW --- CodeCompletion took 3745 ms. 2013-01-15
225310 java Compiler dbalek NEW --- AssertionError at com.sun.tools.javac.util.Assert.error 2013-01-24
225526 java Compiler dbalek NEW --- Autocompletion fails to provide classes from other Maven module 2013-02-11
214836 java Compiler dbalek NEW --- NullPointerException at com.sun.tools.javac.comp.Lower.visitNewClass 2013-02-14
227221 java Compiler dbalek NEW --- Annotation processor run by internal compilation may recieve erroneous javax.lang.model information for generated enums 2013-03-08
231040 java Compiler dbalek NEW --- NullPointerException at com.sun.tools.javac.jvm.Code.typecode 2013-06-10
225027 java Compiler dbalek NEW --- NullPointerException at com.sun.tools.javac.comp.MemberEnter.getMethodEnv 2013-06-15
231390 java Compiler dbalek NEW --- Don't stop output scrolling on "Sun proprietary API" warning 2013-06-17
226677 java Compiler dbalek NEW --- AssertionError at com.sun.tools.javac.util.Assert.error 2013-07-10
208611 java Compiler dbalek NEW --- NullPointerException: #120577: Cannot resolve ElementHandle[kind=CLASS; sigs=org.glassfish.jersey.server.Application$2 ]; file: /home/m_potociar/sandbox/java.net/jersey/core-server/src/main/java/org/g 2013-07-31
220952 java Compiler dbalek NEW --- multiple ; on import 2013-08-01
203540 java Compiler dbalek NEW --- [71cat] ClassCastException: class com.sun.tools.javac.api.JavacTool 2013-09-02
232039 java Compiler dbalek NEW --- Class in same Package not valid type 2013-09-02
226510 java Compiler dbalek NEW --- Window "Action Items" causes unneccessary redeployments 2013-09-02
235539 java Compiler dbalek NEW --- NullPointerException at com.sun.tools.javac.comp.Attr.checkBase 2013-09-05
233615 java Compiler dbalek NEW --- NullPointerException at com.sun.tools.javac.comp.Resolve.checkMethod 2013-09-06
235707 java Compiler dbalek NEW --- CodeCompletion took 8219 ms. 2013-09-09
235737 java Compiler dbalek NEW --- IndexOutOfBoundsException: Index: 1, Size: 1 2013-09-10
235746 java Compiler dbalek NEW --- NullPointerException at com.sun.tools.javac.util.Log$DeferredDiagnosticHandler.report 2013-09-10
211438 java Compiler dbalek NEW --- Endless ClassFormatError exceptions in log 2013-09-13
235950 java Compiler dbalek NEW --- AssertionError: Can't annotate already annotated type: (@some.Any :: some.Outer.Middle.Inner); adding: @some.Counted 2013-09-18
236126 java Compiler dbalek NEW --- NullPointerException at com.sun.tools.javac.code.TypeAnnotations$TypeAnnotationPositions.separateAnnotationsKinds 2013-09-19
230708 java Compiler dbalek REOP --- ClassCastException: java.lang.String cannot be cast to java.lang.Number 2013-09-19
236701 java Compiler dbalek NEW --- AssertionError at com.sun.tools.javac.comp.Lower.classOfType 2013-10-03
177537 java Compiler dbalek NEW --- Throw LinkageError's, not RuntimeException's, for uncompilable source code 2013-10-04
236927 java Compiler dbalek NEW --- Assert errors in ide logs 2013-10-10
237036 java Compiler dbalek NEW --- AssertionError: Inconsistent param types/names. Signature: [addAttributeToModel(PresentationModel, org.opendolphin.core.client.ClientAttribute)], Names: [addAttributeToModel(PresentationModel presenta 2013-10-11
237121 java Compiler dbalek NEW --- NullPointerException at com.sun.tools.javac.jvm.Code.typecode 2013-10-15
236297 java Compiler dbalek NEW --- nb.javac should have version available 2013-10-16
236619 java Compiler dbalek NEW --- File Reliably crashes Netbeans parser 2013-10-18
237945 java Compiler dbalek NEW --- AssertionError at com.sun.tools.javac.util.Assert.error 2013-11-04
238263 java Compiler dbalek NEW --- Missing manifestEncoding attribute from copylibs 2013-11-12
238405 java Compiler dbalek NEW --- IllegalArgumentException: int 2013-11-15
238833 java Compiler dbalek NEW --- StackOverflowError at com.sun.tools.javac.util.Log.shouldReport 2013-11-26
239379 java Compiler dbalek NEW --- Duplicate class warning after moving sources into correct package structure 2013-12-11
239393 java Compiler dbalek NEW --- ((ClassTree) path.getLeaf()).getModifiers().getFlags() always returns ["public", "static] for nested classes/interfaces within interfaces 2013-12-12
239410 java Compiler dbalek NEW --- NullPointerException at com.sun.tools.javac.comp.Attr.checkForDeclarationAnnotations 2013-12-12
233402 java Compiler dbalek NEW --- AssertionError at com.sun.tools.javac.util.Assert.error 2013-12-25
239866 java Compiler dbalek NEW --- OutOfMemoryError: GC overhead limit exceeded 2013-12-30
239826 java Compiler dbalek NEW --- Autocomplete failed whilst adding setTooltip text 2014-01-03
239928 java Compiler dbalek NEW --- AssertionError while editing 2014-01-06
233230 java Compiler dbalek NEW --- AssertionError: No info for outermost class: Compare$Node 2014-01-14
240566 java Compiler dbalek NEW --- NullPointerException at com.sun.tools.javac.code.Types.glb 2014-01-16
240815 java Compiler dbalek NEW --- NullPointerException at com.sun.tools.javac.code.Types$20.visitArrayType 2014-01-22
240846 java Compiler dbalek NEW --- UnsupportedOperationException: FastJar not supported for relocated root of archive C:\Program Files\Java\jdk1.7.0_21\lib\ct.sym, relocation META-INF/sym/rt.jar/ 2014-01-22
241566 java Compiler dbalek NEW --- OutOfMemoryError: GC overhead limit exceeded 2014-02-08
241178 java Compiler dbalek NEW --- CodeCompletion took 2408 ms. 2014-02-10
233830 java Compiler dbalek REOP --- Exception during the build 2014-02-10
241930 java Compiler dbalek NEW --- AssertionError: io.undertow.server.protocol.http.HttpRequestParser$$generated: completer = com.sun.tools.javac.jvm.ClassReader$1@39aea2da; class file = file:/home/mkatakai/.cache/netbeans/dev/index/s3 2014-02-16
237788 java Compiler dbalek NEW --- org.netbeans.modules.java.hints.onsave.RemoveUnusedAfterSave.runLocked: LowPerformance took 24518 ms. 2014-03-11
242882 java Compiler dbalek NEW --- NullPointerException at com.sun.tools.javac.comp.Attr.visitNewClass 2014-03-13
236636 java Compiler dbalek NEW --- NullPointerException at com.sun.tools.javac.comp.Attr.attribTypeVariables 2014-03-16
242968 java Compiler dbalek NEW --- target/generated-sources/groovy-stubs shown with bogus errors 2014-03-21
238654 java Compiler dbalek NEW --- NullPointerException at com.sun.tools.javac.comp.Check.checkConflicts 2014-03-24
229407 java Compiler dbalek NEW --- AssertionError: actual and formal argument lists differ in length 2014-03-25
243062 java Compiler dbalek NEW --- OutOfMemoryError: GC overhead limit exceeded 2014-03-28
243197 java Compiler dbalek NEW --- NullPointerException at com.sun.tools.javac.model.JavacElements.addMembers 2014-03-28
190200 java Compiler dbalek REOP --- Netbean Library Source Code Compile Error 2014-04-01
243693 java Compiler dbalek NEW --- AssertionError at com.sun.tools.javac.util.Assert.error 2014-04-09
244188 java Compiler dbalek NEW --- Can't set a breakpoint inside a lambda 2014-04-30
236685 java Compiler dbalek NEW --- IndexOutOfBoundsException: end < start (21212 < 21237) 2014-05-05
238655 java Compiler dbalek NEW --- NullPointerException at com.sun.tools.javac.model.JavacElements.addMembers 2014-05-07
244415 java Compiler dbalek NEW --- ClassCastException: com.sun.tools.javac.code.Symbol$ClassSymbol cannot be cast to com.sun.tools.javac.util.Name 2014-05-10
243223 java Compiler dbalek NEW --- StackOverflowError at com.sun.tools.javac.code.Types$SameTypeVisitor.visitClassType 2014-05-21
244789 java Compiler dbalek NEW --- NullPointerException at com.sun.tools.javac.comp.Attr.visitBinary 2014-05-29
244926 java Compiler dbalek NEW --- NullPointerException at com.sun.tools.javac.code.Types$DefaultTypeVisitor.visit 2014-06-06
244936 java Compiler dbalek NEW --- NullPointerException at com.sun.tools.javac.comp.Attr$TypeAnnotationsValidator.visitNewClass 2014-06-07
205428 java Compiler dbalek NEW --- CancelAbort stack trace printed to log 2014-07-03
245369 java Compiler dbalek NEW --- OutOfMemoryError: Java heap space 2014-07-03
224611 java Compiler dbalek NEW --- ClassCastException: com.sun.tools.javac.jvm.ClassFile$NameAndType cannot be cast to com.sun.tools.javac.util.Name 2014-07-14
240999 java Compiler dbalek NEW --- IllegalArgumentException: /home/sdl/projects/pure4/git/base-uh/admin/src/main/java/dk@c09ce0a8:6de09db2 (valid: true) not in /home/sdl/projects/pure4/git/base-uh/admin/src/main/java@b112f30c:6c86b2b0 2014-07-22
245928 java Compiler dbalek NEW --- Annotation processor fails with CAL10N 2014-07-23
246150 java Compiler dbalek NEW --- NullPointerException at com.sun.tools.javac.code.Types.isSignaturePolymorphic 2014-07-30
244592 java Compiler dbalek NEW --- NullPointerException at com.sun.tools.javac.code.Symbol.isInheritedIn 2014-08-05
242154 java Compiler dbalek NEW --- IDE dies (hangs) after completion error 2014-08-08
246352 java Compiler dbalek NEW --- AssertionError at com.sun.tools.javac.util.Assert.error 2014-08-08
238802 java Compiler dbalek NEW --- NullPointerException at com.sun.tools.javac.code.Types$DescriptorCache.findDescriptorInternal 2014-08-12
246468 java Compiler dbalek NEW --- AssertionError: Inconsistent param types/names. Signature: [equals-java.lang.Object-], Names: [equals(Object obj)] 2014-08-15
246564 java Compiler dbalek NEW --- NB8 IDE freeze for a while editing JSP with a lot of includes 2014-09-08
247283 java Compiler dbalek NEW --- Annotation: An error occurred during parsing of java/util/Map.java 2014-09-19
247343 java Compiler dbalek NEW --- ClassCastException: com.sun.tools.javac.code.Symbol$ClassSymbol cannot be cast to com.sun.tools.javac.code.Symbol$MethodSymbol 2014-09-21
237081 java Compiler dbalek NEW --- NullPointerException at com.sun.tools.javac.comp.TransTypes.visitMethodDef 2014-09-22
247530 java Compiler dbalek NEW --- Refactoring failure 2014-09-29
247789 java Compiler dbalek NEW --- Compiler failure - ClassCastException 2014-10-08
247814 java Compiler dbalek NEW --- AssertionError: <anonymous > 2014-10-10
248089 java Compiler dbalek NEW --- NullPointerException at com.sun.tools.javac.comp.Check.annotationApplicable 2014-10-22
248247 java Compiler dbalek NEW --- java.lang.NullPointerException at com.sun.tools.javac.comp.Attr.attribTree, NetBeans hangs when saving file 2014-10-29
247781 java Compiler dbalek NEW --- UnsupportedOperationException at java.util.AbstractCollection.add 2014-11-03
247421 java Compiler dbalek NEW --- ClassCastException Type$ErrorType vs. Type$ArrayType 2014-11-14
238735 java Compiler dbalek NEW --- NullPointerException at com.sun.tools.javac.comp.MemberEnter.complete 2014-11-28
240822 java Compiler dbalek NEW --- NullPointerException at com.sun.tools.javac.comp.Resolve.findMethod 2014-11-28
194263 java Compiler dbalek NEW --- java.lang.NoClassDefFoundError thrown when start to debug project 2014-12-08
200970 java Compiler dbalek NEW --- AssertionError at com.sun.tools.javac.util.Assert.error 2014-12-10
249349 java Compiler dbalek NEW --- AssertionError at com.sun.tools.javac.code.Symbol.clone 2014-12-14
249363 java Compiler dbalek NEW --- NullPointerException at com.sun.tools.javac.comp.Attr.visitVarDef 2014-12-15
241275 java Compiler dbalek NEW --- Editor ignores @SuppressWarnings("deprecation") 2014-12-17
238696 java Compiler dbalek NEW --- OutOfMemoryError: Java heap space 2014-12-26
249225 java Compiler dbalek NEW --- ClassCastException: com.sun.tools.javac.code.Type$JCVoidType cannot be cast to com.sun.tools.javac.code.Type$ClassType 2015-01-12
236522 java Compiler dbalek NEW --- NullPointerException at com.sun.tools.javac.comp.Attr.visitTry 2015-01-21
216886 java Compiler dbalek NEW --- AssertionError: class def not found: indexIn(edu.cmu.cs.stage3.alice.core.Element[]) in edu.cmu.cs.stage3.alice.core.Element flags: 2305843009213693954 original: null outermostMemberDef: null outermos 2015-02-08
225159 java Compiler dbalek NEW --- AssertionError at com.sun.tools.javac.jvm.Items$Item.load 2015-02-13
247952 java Compiler dbalek NEW --- ArrayIndexOutOfBoundsException: -1 2015-02-14
250430 java Compiler dbalek NEW --- NetBeans should properly support cross-compiling 2015-02-15
250919 java Compiler dbalek NEW --- NullPointerException at com.sun.tools.javac.main.JavaCompiler.unrecoverableError 2015-03-05
185775 java Compiler dbalek NEW --- ClassCastException: com.sun.tools.javac.code.Type$ClassType cannot be cast to com.sun.tools.javac.code.Type$MethodType 2015-03-12
250970 java Compiler dbalek NEW --- Severe error during refactoring 2015-03-16
251196 java Compiler dbalek NEW --- null pointer exception 2015-03-17
251357 java Compiler dbalek NEW --- NullPointerException at com.sun.tools.javac.code.Type.map 2015-03-23
248162 java Compiler dbalek NEW --- Applying "redundant type arguments in new expression (use diamond operator instead)" hint leads to compiler error 2015-03-24
236368 java Compiler dbalek NEW --- AssertionError: unexpected type: <nulltype> 2015-03-24
242104 java Compiler dbalek NEW --- AssertionError at com.sun.tools.javac.util.Assert.error 2015-03-26
246425 java Compiler dbalek NEW --- NullPointerException at com.sun.tools.javac.comp.Lower.accessClass 2015-03-26
236155 java Compiler dbalek NEW --- NullPointerException at com.sun.tools.javac.comp.Resolve.checkMethod 2015-04-09
251740 java Compiler dbalek NEW --- AssertionError: unexpected type: none 2015-04-12
251840 java Compiler dbalek NEW --- NullPointerException at com.sun.tools.javac.comp.Resolve.rawInstantiate 2015-04-15
241715 java Compiler dbalek NEW --- NullPointerException at com.sun.tools.javac.comp.Attr.visitNewClass 2015-04-19
202755 java Compiler dbalek STAR --- [71cat] AssertionError at com.sun.tools.javac.util.Assert.error 2015-04-22
233098 java Compiler jlahoda REOP --- The following options were not recognized by any processor: '[eclipselink.canonicalmodel.use_static_factory]' 2015-04-24
246834 java Compiler dbalek NEW --- NullPointerException at com.sun.tools.javac.util.Log$DeferredDiagnosticHandler.report 2015-04-30
252190 java Compiler dbalek NEW --- NullPointerException at com.sun.tools.javac.comp.Attr$TypeAnnotationsValidator.visitNewClass 2015-05-01
252203 java Compiler dbalek NEW --- NullPointerException at org.netbeans.modules.java.source.PostFlowAnalysis.visitMethodDef 2015-05-02
252285 java Compiler dbalek NEW --- OutOfMemoryError at java.io.FileInputStream.readBytes 2015-05-07
250843 java Compiler dbalek NEW --- com.sun.tools.javac.util.FatalError: Fatal Error: Unable to find method values 2015-05-08
247595 java Compiler dbalek NEW --- NullPointerException at com.sun.tools.javac.comp.Attr.attribTree 2015-05-10
251864 java Compiler tzezula NEW --- Broken refactoring on files generated by annotation processor 2015-05-11
252344 java Compiler dbalek NEW --- Throwable at com.sun.tools.javac.util.DiagnosticSource.setEndPosTable 2015-05-11
235109 java Compiler dbalek NEW --- AssertionError at com.sun.tools.javac.util.Assert.error 2015-05-14
245790 java Compiler dbalek NEW --- IllegalStateException at org.netbeans.modules.java.source.parsing.WriteBackTransaction.createFileObject 2015-05-15
235871 java Compiler dbalek NEW --- ClassCastException: com.sun.tools.javac.code.Attribute$Error cannot be cast to com.sun.tools.javac.code.Attribute$Class 2015-05-15
252410 java Compiler dbalek NEW --- NullPointerException at com.sun.tools.javac.main.JavaCompiler.unrecoverableError 2015-05-15
252424 java Compiler dbalek NEW --- NullPointerException at com.sun.tools.javac.comp.Attr$TypeAnnotationsValidator.validateAnnotatedType 2015-05-15
236073 java Compiler dbalek NEW --- IllegalArgumentException: org.llvm.adt.DenseMap.iterator 2015-05-18
252223 java Compiler dbalek NEW --- Project running problems depending on path of project 2015-05-19
215830 java Compiler dbalek NEW --- AssertionError: LetExpr is not part of a public API 2015-05-20
251661 java Compiler dbalek NEW --- OutOfMemoryError: GC overhead limit exceeded 2015-05-21
252549 java Compiler dbalek NEW --- Error parsing file doesn't go away after fixing errors 2015-05-22
225024 java Compiler dbalek NEW --- NullPointerException at com.sun.tools.javac.comp.Check.localClassName 2015-05-23
225011 java Compiler dbalek NEW --- AssertionError: isSubtype 20 2015-05-27
252612 java Compiler dbalek NEW --- StackOverflowError at com.sun.tools.javac.comp.Resolve.findVar 2015-05-29
252724 java Compiler dbalek NEW --- ClassCastException: com.sun.tools.javac.tree.JCTree$JCMethodDecl cannot be cast to com.sun.source.tree.StatementTree 2015-06-01
252570 java Compiler dbalek NEW --- java.util.ConcurrentModificationException: Current owner: [java.io.WinNTFileSystem.list(Native Method), java.io.File.list(File.java:1122), java.io.File.listFiles(File.java:1207), org.netbeans.modules. 2015-06-01
252746 java Compiler dbalek NEW --- com.sun.tools.javac.code.Symbol$CompletionFailure: Fatal Error: Unable to find package java.lang in classpath or bootclasspath 2015-06-03
252649 java Compiler dbalek NEW --- ArrayIndexOutOfBoundsException: 1277 2015-06-03
252722 java Compiler dbalek NEW --- AssertionError at com.sun.tools.javac.util.Assert.error 2015-06-15
252129 java Compiler dbalek NEW --- IllegalArgumentException: Incorrect number of type arguments 2015-06-22
252729 java Compiler dbalek NEW --- The type of X is erroneous 2015-06-22
253182 java Compiler dbalek NEW --- NullPointerException at com.sun.tools.javac.comp.Analyzer$DiamondInitializer.process 2015-06-29
252744 java Compiler dbalek NEW --- AssertionError: Wrong diagnostic handler: com.sun.tools.javac.util.Log$DiscardDiagnosticHandler@26a11173 Thread dump: Debugger operator thread java.lang.Object.wait(Native Method) java.lang.Object.w 2015-06-29
253289 java Compiler dbalek NEW --- OutOfMemoryError: GC overhead limit exceeded 2015-07-03
239183 java Compiler dbalek NEW --- com.sun.tools.javac.comp.Resolve$InapplicableMethodException at com.sun.tools.javac.comp.Resolve.<init> 2015-07-07
248441 java Compiler dbalek NEW --- It has been announced as bug before but it continues to happen with 8.0.1 version . when u delete directories or even classes from the project they return to your war file or build directory propably from cache. 2015-07-07
253384 java Compiler dbalek NEW --- AssertionError at com.sun.tools.javac.util.Assert.error 2015-07-09
253396 java Compiler dbalek NEW --- AssertionError at com.sun.tools.javac.util.Assert.error 2015-07-10
250595 java Compiler dbalek NEW --- AssertionError: isSameType UNKNOWN 2015-07-16
253596 java Compiler dbalek NEW --- NullPointerException at com.sun.tools.javac.code.Types$Subst.visitTypeVar 2015-07-21
239657 java Compiler dbalek NEW --- AssertionError at com.sun.tools.javac.util.Assert.error 2015-07-22
249345 java Compiler dbalek NEW --- AssertionError: isSubClass Q 2015-07-22
252403 java Compiler dbalek NEW --- ClassCastException: com.sun.tools.javac.code.Attribute$UnresolvedClass cannot be cast to com.sun.tools.javac.code.Attribute$Class 2015-07-28
253895 java Compiler dbalek NEW --- AssertionError at com.sun.tools.javac.util.Assert.error 2015-07-28
252776 java Compiler dbalek NEW --- NullPointerException at com.sun.tools.javac.processing.JavacProcessingEnvironment$1.visitTopLevel 2015-07-29
252948 java Compiler dbalek NEW --- Convert to lambda is provided for project with source format < 1.8 2015-07-29
252336 java Compiler dbalek NEW --- NullPointerException at com.sun.tools.javac.jvm.Code.emitop1w 2015-07-30
236343 java Compiler dbalek NEW --- AssertionError at com.sun.tools.javac.util.Assert.error 2015-07-30
239261 java Compiler dbalek NEW --- NullPointerException at com.sun.tools.javac.code.Types.isConvertible 2015-08-04
253608 java Compiler dbalek NEW --- NullPointerException at com.sun.tools.javac.comp.Analyzer$LambdaAnalyzer.match 2015-08-06
254191 java Compiler dbalek NEW --- NullPointerException at com.sun.tools.javac.jvm.Code.emitop0 2015-08-07
252916 java Compiler dbalek NEW --- StackOverflowError at com.sun.tools.javac.code.Type.accept 2015-08-07
252918 java Compiler dbalek NEW --- StackOverflowError at com.sun.tools.javac.code.Type$ClassType.isParameterized 2015-08-07
254202 java Compiler dbalek NEW --- IllegalArgumentException: edu.harvard.iq.dataverse.authorization.groups.impl.ipaddress.ip.IpAddressRange&java.io.Serializable 2015-08-07
242393 java Compiler dbalek NEW --- AssertionError at com.sun.tools.javac.util.Assert.error 2015-08-11
253053 java Compiler dbalek NEW --- AssertionError: Null members closure returned for symbol: java.lang.Thread.UncaughtExceptionHandler of type: java.lang.Thread.UncaughtExceptionHandler 2015-08-12
252616 java Compiler dbalek NEW --- AssertionError at com.sun.tools.javac.util.Assert.error 2015-08-12
248963 java Compiler dbalek NEW --- Exception while moving method 2015-08-12
254333 java Compiler dbalek NEW --- NullPointerException at com.sun.tools.javac.parser.JavacParser$SimpleEndPosTable.storeEnd 2015-08-13
246512 java Compiler dbalek NEW --- AssertionError: the result of hiddenInInternal() can't be null 2015-08-17
254479 java Compiler dbalek NEW --- NullPointerException at com.sun.tools.javac.comp.Resolve$AbstractMethodCheck.argumentsAcceptable 2015-08-18
254334 java Compiler dbalek NEW --- AssertionError: Filling jar:file:/D:/java/jdk1.8.0_60_x64/lib/ct.sym!/META-INF/sym/rt.jar/java/lang/System.class during jar:file:/D:/java/jdk1.8.0_60_x64/lib/ct.sym!/META-INF/sym/rt.jar/java/lang/Inte 2015-08-19
226443 java Compiler dbalek NEW --- Throwable at com.sun.tools.javac.util.DiagnosticSource.setEndPosTable 2015-08-20
235218 java Compiler dbalek NEW --- NullPointerException at com.sun.tools.javac.comp.MemberEnter$Synthesizer.visit 2015-08-20
254551 java Compiler dbalek NEW --- AssertionError: Unexpected tree: (activity activity)->(ERROR) with kind: LAMBDA_EXPRESSION within: (activity activity)->(ERROR) with kind: LAMBDA_EXPRESSION 2015-08-20
252230 java Compiler dbalek NEW --- NullPointerException at com.sun.tools.javac.model.JavacTypes.asMemberOf 2015-08-21
254602 java Compiler dbalek NEW --- NullPointerException at com.sun.tools.javac.comp.Resolve.resolveInternalMethod 2015-08-21
254332 java Compiler dbalek NEW --- NullPointerException at com.sun.tools.javac.comp.Resolve$AbstractMethodCheck.argumentsAcceptable 2015-08-23
254646 java Compiler dbalek NEW --- Anonymous subclass with annotated type parameter causes "java.lang.AssertionError: Could not determine position of tree..." Mon 09:40
254649 java Compiler dbalek NEW --- com.sun.tools.javac.comp.Check.checkType: LowPerformance took 35628 ms. Mon 11:15
254510 java Compiler dbalek NEW --- com.sun.tools.javac.jvm.ClassReader.fillIn: LowPerformance took 5877 ms. Mon 15:38
242299 java Compiler dbalek NEW --- NullPointerException at com.sun.tools.javac.main.JavaCompiler.unrecoverableError Mon 17:23
237052 java Compiler dbalek NEW --- NullPointerException at com.sun.tools.javac.util.ListBuffer.append Tue 09:35
247570 java Compiler dbalek NEW --- AssertionError: Unexpected tree: ChequeTercero % o2 with kind: REMAINDER within: ChequeTercero % o2 with kind: REMAINDER Tue 19:29
252312 java Compiler dbalek NEW --- NullPointerException at com.sun.tools.javac.comp.Check.checkNonCyclicElements Wed 07:47
218658 java Compiler dbalek NEW --- Generated Sources for JPA metamodel are not recognized in source packages Wed 23:47
240558 java Compiler dbalek NEW --- IllegalArgumentException: (java.lang.String)void Fri 00:26
254785 java Compiler dbalek NEW --- IndexOutOfBoundsException: Index: 1, Size: 1 Fri 08:14
243699 java Compiler dbalek NEW --- AssertionError at com.sun.tools.javac.util.Assert.error Fri 09:58
242864 java Compiler dbalek NEW --- AssertionError: Value of x -1 13:46:14
241425 java Compiler dbalek STAR --- NullPointerException at com.sun.tools.javac.comp.Check.checkHideClashes 16:43:01
218 bugs found.
  Edit Search  
as

File a new bug in the "java" product

By use of this website, you agree to the NetBeans Policies and Terms of Use. © 2014, Oracle Corporation and/or its affiliates. Sponsored by Oracle logo