Thu Apr 17 2014 21:56:37 UTC
Hide Search Description
  • Resolution: ---
  • Component: Compiler
  • Product: java

166 bugs found.
ID Product Comp Assignee Status Resolution Summary Changed
142810 java Compiler dbalek REOP --- NullPointerException at com.sun.tools.javac.code.Types.makeCompoundType 2013-08-07
230708 java Compiler dbalek REOP --- ClassCastException: java.lang.String cannot be cast to java.lang.Number 2013-09-19
233830 java Compiler dbalek REOP --- Exception during the build 2014-02-10
190200 java Compiler dbalek REOP --- Netbean Library Source Code Compile Error 2014-04-01
197604 java Compiler dbalek NEW --- Not able to compile project 2011-11-16
152191 java Compiler dbalek NEW --- Fix compile on save and compiler issues 2011-01-18
152386 java Compiler dbalek NEW --- AssertionError at com.sun.tools.javac.code.Symbol.clone Tue 09:50
178299 java Compiler dbalek NEW --- NullPointerException at com.sun.tools.javac.jvm.Code.emitop0 2014-03-21
239657 java Compiler dbalek NEW --- AssertionError at com.sun.tools.javac.util.Assert.error 2014-04-11
241006 java Compiler dbalek NEW --- AssertionError: Wrong diagnostic handler: com.sun.tools.javac.util.Log$DeferredDiagnosticHandler@e5f508 2014-04-10
92765 java Compiler dbalek NEW --- package declaration 2010-09-23
126320 java Compiler dbalek NEW --- Turn autocompile off 2010-11-29
134598 java Compiler dbalek NEW --- Build-in support for ODB 2008-05-06
163794 java Compiler dbalek NEW --- Ability to disable support for some primitive types 2010-02-17
177536 java Compiler dbalek NEW --- "Uncompilable source code - cannot find symbol" thrown unnecessarily from <clinit> 2009-11-27
177537 java Compiler dbalek NEW --- Throw LinkageError's, not RuntimeException's, for uncompilable source code 2013-10-04
178289 java Compiler dbalek NEW --- [68cat] Uncompilable code on CoS 2012-11-28
179430 java Compiler dbalek NEW --- The error message box when compiling xml schemas is not needed. 2010-01-12
181884 java Compiler dbalek NEW --- Run/Build Project lead to different default encodings 2010-03-11
185775 java Compiler dbalek NEW --- ClassCastException: com.sun.tools.javac.code.Type$ClassType cannot be cast to com.sun.tools.javac.code.Type$MethodType 2011-09-26
186446 java Compiler dbalek NEW --- Clean and build produces compile-time errors 2010-05-20
187641 java Compiler dbalek NEW --- NullPointerException at com.sun.tools.javac.jvm.Code.emitop1w 2013-03-26
188662 java Compiler dbalek NEW --- AssertionError: isSubtype 12 2012-07-11
190141 java Compiler dbalek NEW --- Integrate Eclipse compiler 2010-09-03
194263 java Compiler dbalek NEW --- java.lang.NoClassDefFoundError thrown when start to debug project 2011-03-31
196747 java Compiler dbalek NEW --- Protection of the JAR Application on Java Desktop Application. 2011-03-15
199177 java Compiler dbalek NEW --- AssertionError at com.sun.tools.javac.util.Assert.error 2013-02-18
200970 java Compiler dbalek NEW --- AssertionError at com.sun.tools.javac.util.Assert.error 2014-04-04
202755 java Compiler dbalek NEW --- [71cat] AssertionError at com.sun.tools.javac.util.Assert.error 2014-03-20
203540 java Compiler dbalek NEW --- [71cat] ClassCastException: class com.sun.tools.javac.api.JavacTool 2013-09-02
205832 java Compiler dbalek NEW --- AE from Attr.attribClassBody 2012-12-20
208611 java Compiler dbalek NEW --- NullPointerException: #120577: Cannot resolve ElementHandle[kind=CLASS; sigs=org.glassfish.jersey.server.Application$2 ]; file: /home/m_potociar/sandbox/java.net/jersey/core-server/src/main/java/org/g 2013-07-31
210393 java Compiler dbalek NEW --- Netbeans runs it's own cache, not just compiled sources 2012-04-04
214649 java Compiler dbalek NEW --- NullPointerException at com.sun.tools.javac.comp.Attr.visitNewClass 2012-06-22
214836 java Compiler dbalek NEW --- NullPointerException at com.sun.tools.javac.comp.Lower.visitNewClass 2013-02-14
215830 java Compiler dbalek NEW --- AssertionError: LetExpr is not part of a public API 2014-01-30
216408 java Compiler dbalek NEW --- Compile on save and F6 2012-08-09
216460 java Compiler dbalek NEW --- NullPointerException at com.sun.tools.javac.jvm.Gen.visitSwitch 2013-02-20
216886 java Compiler dbalek NEW --- AssertionError: class def not found: indexIn(edu.cmu.cs.stage3.alice.core.Element[]) in edu.cmu.cs.stage3.alice.core.Element flags: 2305843009213693954 original: null outermostMemberDef: null outermos 2014-02-19
219738 java Compiler dbalek NEW --- NullPointerException at com.sun.tools.javac.comp.Lower.accessClass 2012-10-09
220952 java Compiler dbalek NEW --- multiple ; on import 2013-08-01
222649 java Compiler dbalek NEW --- Main class was not added to manifest 2012-11-23
224611 java Compiler dbalek NEW --- ClassCastException: com.sun.tools.javac.jvm.ClassFile$NameAndType cannot be cast to com.sun.tools.javac.util.Name 2013-03-21
224706 java Compiler dbalek NEW --- NullPointerException at com.sun.tools.javac.code.Types$DefaultTypeVisitor.visit 2013-01-10
224740 java Compiler dbalek NEW --- NullPointerException at org.netbeans.modules.java.source.PostFlowAnalysis.visitMethodDef 2013-01-11
224770 java Compiler dbalek NEW --- AssertionError at com.sun.tools.javac.util.Assert.error 2013-11-08
224891 java Compiler dbalek NEW --- AssertionError: Attr.visitNewClass tree [new courseList()/*enum*/{ () { super(); } @Override() public String toString() { return "ARM Embedded System Design"; 2013-11-27
224917 java Compiler dbalek NEW --- CodeCompletion took 3745 ms. 2013-01-15
224944 java Compiler dbalek NEW --- NullPointerException at com.sun.tools.javac.main.JavaCompiler.attribute 2013-01-16
225011 java Compiler dbalek NEW --- AssertionError: isSubtype 20 2013-08-27
225024 java Compiler dbalek NEW --- NullPointerException at com.sun.tools.javac.comp.Check.localClassName 2014-03-27
225027 java Compiler dbalek NEW --- NullPointerException at com.sun.tools.javac.comp.MemberEnter.getMethodEnv 2013-06-15
225159 java Compiler dbalek NEW --- AssertionError at com.sun.tools.javac.jvm.Items$Item.load 2013-01-21
225310 java Compiler dbalek NEW --- AssertionError at com.sun.tools.javac.util.Assert.error 2013-01-24
225315 java Compiler dbalek NEW --- NullPointerException at com.sun.tools.javac.comp.Check.annotationApplicable 2013-01-25
225526 java Compiler dbalek NEW --- Autocompletion fails to provide classes from other Maven module 2013-02-11
225879 java Compiler dbalek NEW --- NullPointerException at com.sun.tools.javac.comp.Check$Validator.checkRaw 2013-05-20
226005 java Compiler dbalek NEW --- NullPointerException at com.sun.tools.javac.jvm.Code.emitop1w 2014-04-04
226128 java Compiler dbalek NEW --- javax.persistence.Persistence 2013-02-19
226151 java Compiler dbalek NEW --- AssertionError at com.sun.tools.javac.util.Assert.error 2013-07-18
226398 java Compiler dbalek NEW --- AssertionError at com.sun.tools.javac.util.Assert.error 2013-03-12
226443 java Compiler dbalek NEW --- Throwable at com.sun.tools.javac.util.DiagnosticSource.setEndPosTable 2014-01-21
226479 java Compiler dbalek NEW --- AssertionError at com.sun.tools.javac.util.Assert.error 2014-02-04
226510 java Compiler dbalek NEW --- Window "Action Items" causes unneccessary redeployments 2013-09-02
226523 java Compiler dbalek NEW --- AssertionError: 0,"SymmetryNumber",0 2013-02-22
226566 java Compiler dbalek NEW --- NullPointerException at com.sun.tools.javac.code.Type.isCompound 2013-02-23
226578 java Compiler dbalek NEW --- AssertionError at com.sun.tools.javac.util.Assert.error Mon 08:17
226581 java Compiler dbalek NEW --- NullPointerException at com.sun.tools.javac.jvm.Code.emitop0 2013-02-27
226677 java Compiler dbalek NEW --- AssertionError at com.sun.tools.javac.util.Assert.error 2013-07-10
226894 java Compiler dbalek NEW --- NullPointerException at com.sun.tools.javac.code.TypeAnnotations$TypeAnnotationPositions.annotationType 2013-03-01
227114 java Compiler dbalek NEW --- ClassCastException: com.sun.tools.javac.code.Type$ClassType cannot be cast to com.sun.tools.javac.code.Type$MethodType 2014-04-01
227221 java Compiler dbalek NEW --- Annotation processor run by internal compilation may recieve erroneous javax.lang.model information for generated enums 2013-03-08
227511 java Compiler dbalek NEW --- AssertionError at com.sun.tools.javac.util.Assert.error 2013-05-21
229407 java Compiler dbalek NEW --- AssertionError: actual and formal argument lists differ in length 2014-03-25
231040 java Compiler dbalek NEW --- NullPointerException at com.sun.tools.javac.jvm.Code.typecode 2013-06-10
231390 java Compiler dbalek NEW --- Don't stop output scrolling on "Sun proprietary API" warning 2013-06-17
231466 java Compiler dbalek NEW --- NullPointerException at com.sun.tools.javac.code.Types$HasSameArgs.visitMethodType 2013-09-17
232039 java Compiler dbalek NEW --- Class in same Package not valid type 2013-09-02
233230 java Compiler dbalek NEW --- AssertionError: No info for outermost class: Compare$Node 2014-01-14
233329 java Compiler dbalek NEW --- com.sun.tools.javac.jvm.ClassReader$BadClassFile: bad class file: package-info.class class file contains wrong class: org.junit.package-info Please remove or make sure it appears in the correct su 2014-02-18
233402 java Compiler dbalek NEW --- AssertionError at com.sun.tools.javac.util.Assert.error 2013-12-25
233615 java Compiler dbalek NEW --- NullPointerException at com.sun.tools.javac.comp.Resolve.checkMethod 2013-09-06
235109 java Compiler dbalek NEW --- AssertionError at com.sun.tools.javac.util.Assert.error 2014-01-21
235218 java Compiler dbalek NEW --- NullPointerException at com.sun.tools.javac.comp.MemberEnter$Synthesizer.visit 2014-03-02
235519 java Compiler dbalek NEW --- ClassCastException: com.sun.tools.javac.code.Symbol$ClassSymbol cannot be cast to com.sun.tools.javac.util.Name 2013-09-04
235539 java Compiler dbalek NEW --- NullPointerException at com.sun.tools.javac.comp.Attr.checkBase 2013-09-05
235620 java Compiler dbalek NEW --- AssertionError: isSameType UNKNOWN 2014-03-12
235707 java Compiler dbalek NEW --- CodeCompletion took 8219 ms. 2013-09-09
235737 java Compiler dbalek NEW --- IndexOutOfBoundsException: Index: 1, Size: 1 2013-09-10
235746 java Compiler dbalek NEW --- NullPointerException at com.sun.tools.javac.util.Log$DeferredDiagnosticHandler.report 2013-09-10
235791 java Compiler dbalek NEW --- NullPointerException at com.sun.tools.javac.comp.Lower.visitApply 2014-04-05
235871 java Compiler dbalek NEW --- ClassCastException: com.sun.tools.javac.code.Attribute$Error cannot be cast to com.sun.tools.javac.code.Attribute$Class 2014-03-14
235950 java Compiler dbalek NEW --- AssertionError: Can't annotate already annotated type: (@some.Any :: some.Outer.Middle.Inner); adding: @some.Counted 2013-09-18
236073 java Compiler dbalek NEW --- IllegalArgumentException: org.llvm.adt.DenseMap.iterator 2013-09-17
236126 java Compiler dbalek NEW --- NullPointerException at com.sun.tools.javac.code.TypeAnnotations$TypeAnnotationPositions.separateAnnotationsKinds 2013-09-19
236155 java Compiler dbalek NEW --- NullPointerException at com.sun.tools.javac.comp.Resolve.checkMethod 2013-09-26
236297 java Compiler dbalek NEW --- nb.javac should have version available 2013-10-16
236343 java Compiler dbalek NEW --- AssertionError at com.sun.tools.javac.util.Assert.error 2013-11-25
236368 java Compiler dbalek NEW --- AssertionError: unexpected type: <nulltype> 2014-01-21
236522 java Compiler dbalek NEW --- NullPointerException at com.sun.tools.javac.comp.Attr.visitTry 2013-09-29
236619 java Compiler dbalek NEW --- File Reliably crashes Netbeans parser 2013-10-18
236636 java Compiler dbalek NEW --- NullPointerException at com.sun.tools.javac.comp.Attr.attribTypeVariables 2014-03-16
236685 java Compiler dbalek NEW --- IndexOutOfBoundsException: end < start (21212 < 21237) 2013-10-18
236701 java Compiler dbalek NEW --- AssertionError at com.sun.tools.javac.comp.Lower.classOfType 2013-10-03
236927 java Compiler dbalek NEW --- Assert errors in ide logs 2013-10-10
237036 java Compiler dbalek NEW --- AssertionError: Inconsistent param types/names. Signature: [addAttributeToModel(PresentationModel, org.opendolphin.core.client.ClientAttribute)], Names: [addAttributeToModel(PresentationModel presenta 2013-10-11
237052 java Compiler dbalek NEW --- NullPointerException at com.sun.tools.javac.util.ListBuffer.append 2014-03-16
237081 java Compiler dbalek NEW --- NullPointerException at com.sun.tools.javac.comp.TransTypes.visitMethodDef 2013-10-13
237121 java Compiler dbalek NEW --- NullPointerException at com.sun.tools.javac.jvm.Code.typecode 2013-10-15
237223 java Compiler dbalek NEW --- NullPointerException at com.sun.tools.javac.comp.MemberEnter$Synthesizer.visit 2014-02-18
237788 java Compiler dbalek NEW --- org.netbeans.modules.java.hints.onsave.RemoveUnusedAfterSave.runLocked: LowPerformance took 24518 ms. 2014-03-11
237945 java Compiler dbalek NEW --- AssertionError at com.sun.tools.javac.util.Assert.error 2013-11-04
238263 java Compiler dbalek NEW --- Missing manifestEncoding attribute from copylibs 2013-11-12
238405 java Compiler dbalek NEW --- IllegalArgumentException: int 2013-11-15
238654 java Compiler dbalek NEW --- NullPointerException at com.sun.tools.javac.comp.Check.checkConflicts 2014-03-24
238655 java Compiler dbalek NEW --- NullPointerException at com.sun.tools.javac.model.JavacElements.addMembers 2014-01-20
238696 java Compiler dbalek NEW --- OutOfMemoryError: Java heap space 2013-11-22
238735 java Compiler dbalek NEW --- NullPointerException at com.sun.tools.javac.comp.MemberEnter.complete 2014-04-08
238802 java Compiler dbalek NEW --- NullPointerException at com.sun.tools.javac.code.Types$DescriptorCache.findDescriptorInternal 2014-04-01
238833 java Compiler dbalek NEW --- StackOverflowError at com.sun.tools.javac.util.Log.shouldReport 2013-11-26
239183 java Compiler dbalek NEW --- com.sun.tools.javac.comp.Resolve$InapplicableMethodException at com.sun.tools.javac.comp.Resolve.<init> 2013-12-06
239261 java Compiler dbalek NEW --- NullPointerException at com.sun.tools.javac.code.Types.isConvertible 2014-04-01
239379 java Compiler dbalek NEW --- Duplicate class warning after moving sources into correct package structure 2013-12-11
239393 java Compiler dbalek NEW --- ((ClassTree) path.getLeaf()).getModifiers().getFlags() always returns ["public", "static] for nested classes/interfaces within interfaces 2013-12-12
239410 java Compiler dbalek NEW --- NullPointerException at com.sun.tools.javac.comp.Attr.checkForDeclarationAnnotations 2013-12-12
239461 java Compiler dbalek NEW --- Method parameter without PARAMETER flag 2014-01-20
239826 java Compiler dbalek NEW --- Autocomplete failed whilst adding setTooltip text 2014-01-03
239866 java Compiler dbalek NEW --- OutOfMemoryError: GC overhead limit exceeded 2013-12-30
239928 java Compiler dbalek NEW --- AssertionError while editing 2014-01-06
240558 java Compiler dbalek NEW --- IllegalArgumentException: (java.lang.String)void 2014-02-16
240566 java Compiler dbalek NEW --- NullPointerException at com.sun.tools.javac.code.Types.glb 2014-01-16
240729 java Compiler dbalek NEW --- [80cat]IllegalArgumentException at com.sun.tools.javac.api.JavacTaskImpl.doParse 2014-01-21
240815 java Compiler dbalek NEW --- NullPointerException at com.sun.tools.javac.code.Types$20.visitArrayType 2014-01-22
240822 java Compiler dbalek NEW --- NullPointerException at com.sun.tools.javac.comp.Resolve.findMethod 2014-01-22
240846 java Compiler dbalek NEW --- UnsupportedOperationException: FastJar not supported for relocated root of archive C:\Program Files\Java\jdk1.7.0_21\lib\ct.sym, relocation META-INF/sym/rt.jar/ 2014-01-22
240978 java Compiler dbalek NEW --- NullPointerException at com.sun.source.util.TreePath.getPath 2014-01-26
240999 java Compiler dbalek NEW --- IllegalArgumentException: /home/sdl/projects/pure4/git/base-uh/admin/src/main/java/dk@c09ce0a8:6de09db2 (valid: true) not in /home/sdl/projects/pure4/git/base-uh/admin/src/main/java@b112f30c:6c86b2b0 2014-01-27
241178 java Compiler dbalek NEW --- CodeCompletion took 2408 ms. 2014-02-10
241275 java Compiler dbalek NEW --- Editor ignores @SuppressWarnings("deprecation") 2014-02-09
241425 java Compiler dbalek NEW --- NullPointerException at com.sun.tools.javac.comp.Check.checkHideClashes 2014-02-05
241476 java Compiler dbalek NEW --- [80cat]Providing Custom annotation processor is not reflected in Editor or Run. Build works fine 2014-02-06
241541 java Compiler dbalek NEW --- AssertionError: Wrong diagnostic handler: com.sun.tools.javac.util.Log$DeferredDiagnosticHandler@12b5c61 2014-02-11
241566 java Compiler dbalek NEW --- OutOfMemoryError: GC overhead limit exceeded 2014-02-08
241715 java Compiler dbalek NEW --- NullPointerException at com.sun.tools.javac.comp.Attr.visitNewClass 2014-02-11
241930 java Compiler dbalek NEW --- AssertionError: io.undertow.server.protocol.http.HttpRequestParser$$generated: completer = com.sun.tools.javac.jvm.ClassReader$1@39aea2da; class file = file:/home/mkatakai/.cache/netbeans/dev/index/s3 2014-02-16
242104 java Compiler dbalek NEW --- AssertionError at com.sun.tools.javac.util.Assert.error 2014-02-28
242108 java Compiler dbalek NEW --- AssertionError: Unexpected tree: pool.<IOException>await() with kind: METHOD_INVOCATION within: pool.<IOException>await() with kind: METHOD_INVOCATION 2014-04-06
242299 java Compiler dbalek NEW --- NullPointerException at com.sun.tools.javac.main.JavaCompiler.unrecoverableError Sun 21:23
242393 java Compiler dbalek NEW --- AssertionError at com.sun.tools.javac.util.Assert.error 2014-03-01
242637 java Compiler dbalek NEW --- CodeCompletion took 2346 ms. 2014-03-06
242717 java Compiler dbalek NEW --- NullPointerException at com.sun.tools.javac.comp.Attr$TypeAnnotationsValidator.visitNewClass 2014-03-09
242864 java Compiler dbalek NEW --- AssertionError: Value of x -1 2014-04-03
242882 java Compiler dbalek NEW --- NullPointerException at com.sun.tools.javac.comp.Attr.visitNewClass 2014-03-13
242968 java Compiler dbalek NEW --- target/generated-sources/groovy-stubs shown with bogus errors 2014-03-21
242970 java Compiler dbalek NEW --- OutOfMemoryError: GC overhead limit exceeded 2014-03-17
243062 java Compiler dbalek NEW --- OutOfMemoryError: GC overhead limit exceeded 2014-03-28
243197 java Compiler dbalek NEW --- NullPointerException at com.sun.tools.javac.model.JavacElements.addMembers 2014-03-28
243369 java Compiler dbalek NEW --- NetBeans 8.0 does not copy dependent libraries to dist/lib 2014-03-29
243597 java Compiler dbalek NEW --- NullPointerException at com.sun.tools.javac.comp.Resolve.findMethod 2014-04-06
243693 java Compiler dbalek NEW --- AssertionError at com.sun.tools.javac.util.Assert.error 2014-04-09
243699 java Compiler dbalek NEW --- AssertionError at com.sun.tools.javac.util.Assert.error 2014-04-09
206076 java Compiler tzezula NEW --- Outer class is not visible in scope of inner class 2011-12-07
124864 java Compiler dbalek NEW --- Problems with nested generics 2009-10-30
139183 java Compiler dbalek NEW --- Reference tree for compiler dependencies 2008-07-07
211438 java Compiler dbalek NEW --- Endless ClassFormatError exceptions in log 2013-09-13
218658 java Compiler dbalek NEW --- Generated Sources for JPA metamodel are not recognized in source packages 2014-01-30
166 bugs found.
  Edit Search  
as

File a new bug in the "java" product

By use of this website, you agree to the NetBeans Policies and Terms of Use. © 2012, Oracle Corporation and/or its affiliates. Sponsored by Oracle logo